{"text_format":"1","workbook":"xlsx","n_sheets":11,"sheets":["Input","Income Calculators","Loan Feature Input","Results Page","Loan Works Drop","Calculations","Formulas","Console","HEM","Subordinate Calculator","Version Control"],"not_rendered":{"charts":0,"images":4,"macros":1,"external_links":1,"defined_names":2,"comments":3,"pivot_tables":0},"unopened":[],"bounds":{"document_bytes":16777216,"sheet_cells":100000,"rows_first":2000,"rows_last":500,"rows_between":2000,"halvings":0,"cell_chars":16384,"cell_head_chars":4096},"cells_cut":0,"cells_raw":0,"read":"whole","date_system":"1900"}

{"sheet":"Input","index":0,"n_rows":155,"n_cols":33,"rows_kept":155,"cut":false,"hidden":false,"merged":[[6,11,6,13],[154,3,158,19],[148,15,149,17],[9,1,9,19],[24,1,24,19],[105,1,105,19],[27,3,27,11],[35,3,35,11],[45,3,45,11],[54,3,54,11],[62,3,62,11]]}
[null,null,null,null,null,null,null,null,null," ",null,null,null,null,null,null,null,null,null,"Version 4.6.0\n20/08/2025"]
[null,null,null,null,null,null,null,null,null,null,null,"Specialist Servicing Calculator"]
[]
[]
[]
[]
{"$rows_left_out":150}
{"sheet":"Income Calculators","index":1,"n_rows":33,"n_cols":20,"rows_kept":33,"cut":false,"hidden":false,"merged":[[32,1,32,7],[25,1,25,3],[24,1,24,7]]}
[]
[null,"YTD Gross Income Calculator"]
[null,"Results to go into Income Table on the Input sheet as Type Salary:"]
[null,null,null,"YTD Gross Income:","eg. $78,546.23",null,null,"FY Year","eg. FY20",null,null,null,null,"Date of last payslip:","eg. 1/Nov/2019"]
[]
[null,null,null,"Annual Gross Income:",null,{"$f":"IFERROR((365.25/(P4-VLOOKUP(J4,Console!$BM$3:$BN$5,2,FALSE)))*F4,\"\")","v":""}]
{"$rows_left_out":28}
{"sheet":"Loan Feature Input","index":2,"n_rows":78,"n_cols":20,"rows_kept":78,"cut":false,"hidden":true,"merged":[[2,14,4,14],[2,8,4,8],[2,9,4,9],[2,10,4,10],[2,11,2,13],[3,11,3,13]]}
[]
[]
[null,null,"Loan Field",null,"Input",null,null,null,"DLA Authority","DLA","DLA Approver","DLA – Item 1",null,null,"DLA – Item 2 Exception"]
[null,null,"Documentation"," eg. Full Doc",null,null,null,null,null,null,null,"SC output @ AAA level"]
[null,null,"Employment"," eg. PAYE/Full Time",null,null,null,null,null,null,null,"0 - 25%","> 25 - 35%","> 35%",null,null,null,0.25,0.35,9999.99]
[null,null,"Months Business in Operation (for self-employed)"," eg. 0",null,null,null,null,"Highest","DLA 1","General Manager (GM)","<=A$3.0M","<=A$3.0M","<=$A$3.0M","Major",null,"DLA 1",3000000,3000000,3000000]
{"$rows_left_out":73}
{"sheet":"Results Page","index":3,"n_rows":95,"n_cols":6,"rows_kept":95,"cut":false,"hidden":true,"merged":[[74,2,74,3],[79,2,79,3],[78,2,78,3],[77,2,77,3],[76,2,76,3],[75,2,75,3],[71,2,71,3],[72,2,72,3],[92,2,92,3],[91,2,91,3],[90,2,90,3],[89,2,89,3],[88,2,88,3],[87,2,87,3],[86,2,86,3],[85,2,85,3],[73,2,73,3],[84,2,84,3],[83,2,83,3],[82,2,82,3],[81,2,81,3],[80,2,80,3]]}
[]
[null,"Results",null,null,{"$f":"NOW()","v":"2025-09-12T13:36:37.040"}]
[]
[null,"Loan Summary"]
[]
[null,"Applicant Name(s):",{"$f":"Input!L7","v":0},null,"Underwriter:",{"$f":"Input!T7","v":0}]
{"$rows_left_out":90}
{"sheet":"Loan Works Drop","index":4,"n_rows":51,"n_cols":3,"rows_kept":51,"cut":false,"hidden":true,"merged":[]}
["#","Loan Field","Specific Loan Input"]
[1,"Loan ID",1]
[{"$f":"OFFSET(A3,-1,)+1","v":2},"Issuer","tester"]
[3,"Loan Type","Sub-prime"]
[4,"Borrower Group ID",1]
[5,"Borrower Residency","Australian"]
{"$rows_left_out":46}
{"sheet":"Calculations","index":5,"n_rows":123,"n_cols":23,"rows_kept":123,"cut":false,"hidden":true,"merged":[]}
[]
["*Calculate annualised income",null,null,null,null,null,"Gross Incomes","Net Income",null,null,null,"Gross Income by Household",null,null,null,null,null,"Net Incomes by household"]
["Applicant Number","Applicant","Household","Income","Type","Frequency","Annualised","Annualised","Negative Gearing scaling","Negative Gearing Attribution",null,1,2,3,4,5,null,1,2,3,4,5]
[1,{"$f":"Input!#REF!","v":{"$error":"#REF!"}},{"$f":"Input!#REF!","v":{"$error":"#REF!"}},{"$f":"Input!#REF!","v":{"$error":"#REF!"}},{"$f":"Input!#REF!","v":{"$error":"#REF!"}},{"$f":"Input!#REF!","v":{"$error":"#REF!"}},{"$f":"IF(B4=0,0,IFERROR(IF(OR(E4=$L$7,E4=$L$8,E4=$L$9,E4=$L$10,E4=$L$11,E4=$L$12),0,VLOOKUP(E4,Console!$T$3:$U$18,2,FALSE)*VLOOKUP(F4,Console!$X$3:$Y$9,2,FALSE)),0)*D4)","v":{"$error":"#REF!"}},{"$f":"IFERROR(IF(OR(E4=$L$7,E4=$L$8,E4=$L$9,E4=$L$10,E4=$L$11,E4=$L$12),VLOOKUP(E4,Console!$T$3:$U$18,2,FALSE)*VLOOKUP(F4,Console!$X$3:$Y$9,2,FALSE),0),0)*D4","v":{"$error":"#REF!"}},{"$f":"(G4/20000)*G4","v":{"$error":"#REF!"}},{"$f":"IFERROR(I4/SUM($I$4:$I$23),0)","v":0},null,{"$f":"SUMIF($C$4:$C$23,R3,$G$4:$H$23)-IF(Console!$BQ$9=1,0,SUMIF(Calculations!$B$64:$B$68,Calculations!L3,Calculations!$G$64:$G$68))","v":0},{"$f":"SUMIF($C$4:$C$23,S3,$G$4:$H$23)-IF(Console!$BQ$9=1,0,SUMIF(Calculations!$B$64:$B$68,Calculations!M3,Calculations!$G$64:$G$68))","v":0},{"$f":"SUMIF($C$4:$C$23,T3,$G$4:$H$23)-IF(Console!$BQ$9=1,0,SUMIF(Calculations!$B$64:$B$68,Calculations!N3,Calculations!$G$64:$G$68))","v":0},{"$f":"SUMIF($C$4:$C$23,U3,$G$4:$H$23)-IF(Console!$BQ$9=1,0,SUMIF(Calculations!$B$64:$B$68,Calculations!O3,Calculations!$G$64:$G$68))","v":0},{"$f":"SUMIF($C$4:$C$23,V3,$G$4:$H$23)-IF(Console!$BQ$9=1,0,SUMIF(Calculations!$B$64:$B$68,Calculations!P3,Calculations!$G$64:$G$68))","v":0},null,{"$f":"SUMIF($C$4:$C$23,R3,$H$4:$H$23)","v":0},{"$f":"SUMIF($C$4:$C$23,S3,$H$4:$H$23)","v":0},{"$f":"SUMIF($C$4:$C$23,T3,$H$4:$H$23)","v":0},{"$f":"SUMIF($C$4:$C$23,U3,$H$4:$H$23)","v":0},{"$f":"SUMIF($C$4:$C$23,V3,$H$4:$H$23)","v":0}]
[2,{"$f":"Input!#REF!","v":{"$error":"#REF!"}},{"$f":"Input!#REF!","v":{"$error":"#REF!"}},{"$f":"Input!#REF!","v":{"$error":"#REF!"}},{"$f":"Input!#REF!","v":{"$error":"#REF!"}},{"$f":"Input!#REF!","v":{"$error":"#REF!"}},{"$f":"IF(B5=0,0,IFERROR(IF(OR(E5=$L$7,E5=$L$8,E5=$L$9,E5=$L$10,E5=$L$11,E5=$L$12),0,VLOOKUP(E5,Console!$T$3:$U$18,2,FALSE)*VLOOKUP(F5,Console!$X$3:$Y$9,2,FALSE)),0)*D5)","v":{"$error":"#REF!"}},{"$f":"IFERROR(IF(OR(E5=$L$7,E5=$L$8,E5=$L$9,E5=$L$10,E5=$L$11,E5=$L$12),VLOOKUP(E5,Console!$T$3:$U$18,2,FALSE)*VLOOKUP(F5,Console!$X$3:$Y$9,2,FALSE),0),0)*D5","v":{"$error":"#REF!"}},{"$f":"(G5/20000)*G5","v":{"$error":"#REF!"}},{"$f":"IFERROR(I5/SUM($I$4:$I$23),0)","v":0},"HEM",{"$f":"HLOOKUP(L4+R4,HEM!$F$1:$S$2,2,TRUE)","v":3},{"$f":"HLOOKUP(M4+S4,HEM!$F$1:$S$2,2,TRUE)","v":3},{"$f":"HLOOKUP(N4+T4,HEM!$F$1:$S$2,2,TRUE)","v":3},{"$f":"HLOOKUP(O4+U4,HEM!$F$1:$S$2,2,TRUE)","v":3},{"$f":"HLOOKUP(P4+V4,HEM!$F$1:$S$2,2,TRUE)","v":3}]
[3,{"$f":"Input!#REF!","v":{"$error":"#REF!"}},{"$f":"Input!#REF!","v":{"$error":"#REF!"}},{"$f":"Input!#REF!","v":{"$error":"#REF!"}},{"$f":"Input!#REF!","v":{"$error":"#REF!"}},{"$f":"Input!#REF!","v":{"$error":"#REF!"}},{"$f":"IF(B6=0,0,IFERROR(IF(OR(E6=$L$7,E6=$L$8,E6=$L$9,E6=$L$10,E6=$L$11,E6=$L$12),0,VLOOKUP(E6,Console!$T$3:$U$18,2,FALSE)*VLOOKUP(F6,Console!$X$3:$Y$9,2,FALSE)),0)*D6)","v":{"$error":"#REF!"}},{"$f":"IFERROR(IF(OR(E6=$L$7,E6=$L$8,E6=$L$9,E6=$L$10,E6=$L$11,E6=$L$12),VLOOKUP(E6,Console!$T$3:$U$18,2,FALSE)*VLOOKUP(F6,Console!$X$3:$Y$9,2,FALSE),0),0)*D6","v":{"$error":"#REF!"}},{"$error":"#REF!"},0,null,"List of Net Income Salary Types"]
{"$rows_left_out":118}
{"sheet":"Formulas","index":6,"n_rows":126,"n_cols":24,"rows_kept":126,"cut":false,"hidden":true,"merged":[]}
[null,null,null,null,"Applicant"]
[null,null,null,null,1,2,3,4,5,6,7,8,9,10,11,12,13,14,15,16,17,18,19,20]
["Household",1,null,null,{"$f":"Input!D27*Formulas!$B3","v":0},{"$f":"Input!F27*Formulas!$B3","v":0},{"$f":"Input!H27*Formulas!$B3","v":0},{"$f":"Input!J27*Formulas!$B3","v":0},{"$f":"Input!L27*Formulas!$B3","v":0},{"$f":"Input!N27*Formulas!$B3","v":0},{"$f":"Input!P27*Formulas!$B3","v":0},{"$f":"Input!R27*Formulas!$B3","v":0},{"$f":"Input!T27*Formulas!$B3","v":0},{"$f":"Input!V27*Formulas!$B3","v":0},{"$f":"Input!X27*Formulas!$B3","v":0},{"$f":"Input!Y27*Formulas!$B3","v":0},{"$f":"Input!Z27*Formulas!$B3","v":0},{"$f":"Input!AA27*Formulas!$B3","v":0},{"$f":"Input!AB27*Formulas!$B3","v":0},{"$f":"Input!AC27*Formulas!$B3","v":0},{"$f":"Input!AD27*Formulas!$B3","v":0},{"$f":"Input!AE27*Formulas!$B3","v":0},{"$f":"Input!AF27*Formulas!$B3","v":0},{"$f":"Input!AG27*Formulas!$B3","v":0}]
["Income Type","Shading","Gross/ Net"]
["Gross PAYG",1,"Gross",null,{"$f":"Input!D29*Formulas!$B5","v":0},{"$f":"Input!F29*Formulas!$B5","v":0},{"$f":"Input!H29*Formulas!$B5","v":0},{"$f":"Input!J29*Formulas!$B5","v":0},{"$f":"Input!L29*Formulas!$B5","v":0},{"$f":"Input!N29*Formulas!$B5","v":0},{"$f":"Input!P29*Formulas!$B5","v":0},{"$f":"Input!R29*Formulas!$B5","v":0},{"$f":"Input!T29*Formulas!$B5","v":0},{"$f":"Input!V29*Formulas!$B5","v":0},{"$f":"Input!X29*Formulas!$B5","v":0},{"$f":"Input!Y29*Formulas!$B5","v":0},{"$f":"Input!Z29*Formulas!$B5","v":0},{"$f":"Input!AA29*Formulas!$B5","v":0},{"$f":"Input!AB29*Formulas!$B5","v":0},{"$f":"Input!AC29*Formulas!$B5","v":0},{"$f":"Input!AD29*Formulas!$B5","v":0},{"$f":"Input!AE29*Formulas!$B5","v":0},{"$f":"Input!AF29*Formulas!$B5","v":0},{"$f":"Input!AG29*Formulas!$B5","v":0}]
["Contract PAYG",1,"Gross",null,{"$f":"Input!D30*Formulas!$B6","v":0},{"$f":"Input!F30*Formulas!$B6","v":0},{"$f":"Input!H30*Formulas!$B6","v":0},{"$f":"Input!J30*Formulas!$B6","v":0},{"$f":"Input!L30*Formulas!$B6","v":0},{"$f":"Input!N30*Formulas!$B6","v":0},{"$f":"Input!P30*Formulas!$B6","v":0},{"$f":"Input!R30*Formulas!$B6","v":0},{"$f":"Input!T30*Formulas!$B6","v":0},{"$f":"Input!V30*Formulas!$B6","v":0},{"$f":"Input!X30*Formulas!$B6","v":0},{"$f":"Input!Y30*Formulas!$B6","v":0},{"$f":"Input!Z30*Formulas!$B6","v":0},{"$f":"Input!AA30*Formulas!$B6","v":0},{"$f":"Input!AB30*Formulas!$B6","v":0},{"$f":"Input!AC30*Formulas!$B6","v":0},{"$f":"Input!AD30*Formulas!$B6","v":0},{"$f":"Input!AE30*Formulas!$B6","v":0},{"$f":"Input!AF30*Formulas!$B6","v":0},{"$f":"Input!AG30*Formulas!$B6","v":0}]
{"$rows_left_out":121}
{"sheet":"Console","index":7,"n_rows":29,"n_cols":73,"rows_kept":29,"cut":false,"hidden":true,"merged":[]}
["Product Data",null,null,null,null,null,null,null,null,null,null,null,null,null,null,null,null,null,null,"Income Data",null,null,null,null,null,null,null,null,null,null,null,null,null,null,null,null,null,"Expense Data",null,null,null,null,null,null,null,"Liability Data",null,null,null,null,null,"Old version no longer used since 11th Aug 2020, kept for reference",null,null,null,null,"Old version no longer used since 11th Aug 2020",null,null,null,null,null,null,null,null,null,null,null,"TOGGLES"]
["Products","Rate","Rate Loading","Assessment Rate",null,"Floor Rate",null,"Yes","IO","OO","Loan Term","P&I","IO",null,"Loan Amount",null,"States","Interest Only Terms",null,"Income Types","Allowance","Tax Type",null,"Payment Frequency","Multiplier",null,"Taxable Income ","Tax on this income ","Min","Max","Scalar","Rate",null,"Medicare Levy",null,"Company tax rate",null,"Living Expenses","Discretionary?",null,"HEM BUFFER",null,"Toggle Liabilities Calc:",null,null,"Liability Type","Multiplier",null,"Notes","Notes",null,"Hecs Payments",null,null,null,null,"Adults",null,null,null,null,null,null,null,"FY Years","Start Date",null,null,"Negative Gearing Option",null,"Negative Gearing options"]
["All Loan Types",null,0.02,{"$f":"C3+B3","v":0.02},"For Aggregate Lending on all loan purposes and products",5.6000000000000001E-2,null,"No","P&I","Inv","Minimum",1,1,null,"Miniumum",1000,"NSW",1,null,"Salary",1,"Progressive",null,"Annually",1,null,"0-$18,200 ","Nil ",0,18200,0,0,null,0.02,null,0.3,null,"Childcare ","No",null,0,null,"Use MAX of calc payment or delcared payment",null,null,"New Debt ",1,null,null,"Loan amount @ assessment rate, over loan term - P&I",null,"Repayment Income ",null,"Repayment Rate ",null,"Children",1,2,3,4,5,6,null,null,"FY20","2019-07-01",null,null,1,null,1,"Full","On all investment loans, the interest charged each year is applied as a tex deduction to gross income"]
["$ for $ Refi",null,0.01,{"$f":"C4+B4","v":0.01},"For Aggregate Lending with only Refinance loan purpose i.e no Cash out, no other debt consolidation, no purchase etc",null,null,null,null,null,"Maximum",30,5,null,"Maximum",99999999,"VIC",2,null,"Net Salary",1,"None",null,"Half Yearly",2,null,"$18,201 - $45,000","19c for each $1 over $18,200",{"$f":"AD3+0.001","v":18200.001},45000,0,0.16,null,null,null,null,null,"Clothing & other personal expenses ","No",null,null,null,null,null,null,"OO Mortgage",1.25,{"$f":"-AU4*PMT(Input!P12/12,30*12,100000,0,0)/100000","v":7.1759872580171484E-3},"Loading 25% ","Actual Pmt + 25% used, if no actual payment then 30yr P&I at assessment rate at 25% loading",null,0,0,0,null,0,{"$f":"AR8","v":0},{"$f":"AR3","v":0},{"$f":"BF4+$AR$15","v":0},{"$f":"BG4+$AR$15","v":0},{"$f":"BH4+$AR$15","v":0},{"$f":"BI4+$AR$15","v":0},null,null,"FY21","2020-07-01",null,null,null,null,2,"Partial","Interest is NOT used as a tax deduction, but rental incomes are treated as not taxable incomes"]
["Fixed Rate Only",null,1.4999999999999999E-2,{"$f":"C5+B5","v":1.4999999999999999E-2},"For Aggregate Lending with only Fixed Rate loan product(s) i.e no variable products","Personal Loan Other Liability Rate",null,null,null,"OO",null,null,null,null,null,null,"QLD",3,null,"Part Time Job",1,"Progressive",null,"Quarterly",4,null,"$45,001 – $135,000","$4,288 plus 30c for each $1 over $45,000",{"$f":"AD4+0.001","v":45000.000999999997},135000,{"$f":"ROUND((AD4-AC4)*AF4,2)+AE4","v":4288},0.3,null,null,null,"Business Type",null,"Education ","No",null,null,null,null,null,null,"Investment Mortgage",1.25,{"$f":"-AU5*PMT(Input!P12/12,30*12,100000,0,0)/100000","v":7.1759872580171484E-3},"Loading 25% ","Actual Pmt + 25% used, if no actual payment then 30yr P&I at assessment rate at 25% loading",null,"Below $45,881",45881,0.01,null,1,{"$f":"AR9","v":0},{"$f":"AR4","v":0},{"$f":"BF5+$AR$15","v":0},0,0,0,null,null,"FY22","2021-07-01",null,null,null,null,3,"Off","Interest is NOT used to deduct taxable income, and rental incomes are taxed"]
["Flow Buffer ",null,0.03,{"$f":"C6+B6","v":0.03},null,0.12,null,null,null,"Inv Property",null,null,null,null,null,null,"SA",4,null,"Casual",1,"Progressive",null,"Monthly",12,null,"$135,001 – $190,000","$31,288 plus 37c for each $1 over $135,000",135000.00099999999,190000,{"$f":"ROUND((AD5-AC5)*AF5,2)+AE5","v":31288},0.37,null,null,null,"Sole Trader",null,"Groceries ","No",null,null,null,null,null,null,"Personal Loan",1,{"$f":"-PMT(F6/12,7*12,10000,0,0)/10000","v":1.7652732797073818E-2},"Actual ","Actual repayment ",null,"$45,881 -$52,973",52973,0.02,null,2,{"$f":"AR10","v":0},{"$f":"AR5","v":0},0,0,0,0]
{"$rows_left_out":24}
{"sheet":"HEM","index":8,"n_rows":12,"n_cols":20,"rows_kept":12,"cut":false,"hidden":true,"merged":[]}
[null,"Adults","Children","UNIQUE",null,0,26000,39000,52000,66000,79000,105000,131000,157000,184000,210000,262000,328000,394000,9.9999999999999898E+18]
[null,null,null,null,"Australia",3,4,5,6,7,8,9,10,11,12,13,14,15,16]
[null,2,0,{"$f":"CONCATENATE(B3,C3)","v":"20"},"Couple",598.59527296115107,598.59527296115107,613.32872098779649,638.18431144810233,678.87315014878493,741.81667604160373,829.08944485757706,903.07293066606462,985.39916656433468,1033.7842059931695,1099.8054338458803,1216.3258149006804,1388.6400400406708,1403.4678593893548]
[null,2,1,{"$f":"CONCATENATE(B4,C4)","v":"21"},"Couple with 1 child",703.51899957818148,703.51899957818148,703.51899957818148,728.48082038791324,769.34355930828247,832.55609813203796,920.20186214651881,994.50154633083537,1077.1796333128111,1125.7714689930131,1192.0748656060207,1309.0932390215287,1482.1439182614597,1497.0351089850494]
[null,2,2,"22","Couple with 2 children",769.22357063259119,769.22357063259119,769.22357063259119,794.02242935592733,834.61839960118948,897.41826001395214,984.49183384659568,1058.3064576088584,1140.4447887788799,1188.719394081538,1254.5899333652314,1370.8443620638839,1542.765293290659,1557.5592675228254]
[null,2,3,"23","Couple with 3 children",858.95471961975863,858.95471961975863,858.95471961975863,858.95471961975863,899.53594275422711,962.31299555738872,1049.3549410704306,1123.1427536744909,1205.2512476862421,1253.5083181368573,1319.3549311319284,1435.5671329422671,1607.4256140729617,1622.2142183478081]
{"$rows_left_out":7}
{"sheet":"Subordinate Calculator","index":9,"n_rows":351,"n_cols":43,"rows_kept":351,"cut":false,"hidden":true,"merged":[]}
[]
[]
[null,"SECTION 1 - Loan Features",null,null,null,null,null,null,"SECTION 2 - Subordination",null,null,null,null,null,null,null,null,null,null,null,null,"SECTION 3 - Inputs"]
[]
[]
[]
{"$rows_left_out":346}
{"sheet":"Version Control","index":10,"n_rows":30,"n_cols":5,"rows_kept":30,"cut":false,"hidden":true,"merged":[]}
["Version","Date","Editor","Change Request","Edits"]
[2.4,"2020-10-14","Jake Miller","Good Morning Jake, \n\nHappy Hump Day! \n\nCould you please look to adjust the BNK servicing with the new tax rates as per the budget announcement? \n\nThe details will be on the ATO website.  Please ensure you keep a list of any changes for version control. \n\nLet me know if you have any questions or require any assistance. \n\nThanks, \n","https://www.ato.gov.au/General/New-legislation/In-detail/Direct-taxes/Income-tax-for-individuals/JobMaker-Plan---bringing-forward-the-Personal-Income-Tax-Plan/\n\nEdit made from above table, in console increasing the tax rates:\nincrease the low income tax offset (LITO) from $445 to $700 and adjust the phase out rules\nincrease the top threshold of the 19% personal income tax bracket from $37,000 to $45,000, and\nincrease the top threshold of the 32.5% personal income tax bracket from $90,000 to $120,000.\n\nTaxable income\n\nTax on this income\n\n0 to $18,200\n\nNil\n\n$18,201 to $45,000\n\n19cents for each $1 over $18,200\n\n$45,001 to $120,000\n\n$5,092 plus 32.5cents for each $1 over $45,000\n\n$120,001 to $180,000\n\n$29,467 plus 37cents for each $1 over $120,000\n\n$180,001 and over\n\n$51,667 plus 45cents for each $1 over $180,000"]
[2.5,"2020-10-23","Jake Miller","Change request from Ben Shirvani:\nHi Jake \n\n• Please add rental income for cat 3 with 60% shading\n• Fix the bug for  overtime, commission and investment income (sees like I of investment is also missing )\n","Added rental income for category 3 with 60% shaded income, this unhid one of the free rental income types in the input and updated the shading in the formulas sheet.\nFixed bug where overtime income was not showing, the sum formula in the input sheet in row 44 was referencing the formulas sheet and looking it rows 15 to 20, where it should of been referencing rows 13 to 20.\nFixed bug in DTI/ LTI where personal loan was entered but balance and limit was not entered, then the limit was inferred incorrectly, this has been updated to set reversed limits to 0, and a flag has been put in input sheet in cells R107:R132 where if balance or limit has not been entered it will give a warning prompt."]
[2.6,"2020-11-17","Jake Miller","Change Request from Kean Burke and Scott Smith:\nThe major difference is that BNK calculator is deducting company tax from the NPBT and then adding this back to the borrower personal income and then it’s taxed again at personal tax rates.","Added option on Input page to select between borrower entity, now drop down option for business or individual.\nWhen Business is selected in the formulas sheet in cell range C40 to C46, there is an if statement that will change the taxable income from gross to net, what this then does it treats the business income as tax exempt from personal income, the business income tax rates will apply but the personal tax income rates do not. This essentially treats both entities seperately and filing seperate tax returns.\nWhen Individual is selected, then any business profit is treated as franked dividend, in this case franking credits are applied to the individuals total taxable income.\nThe next factor is if the business is company or SP/Partnership, as SP and Partnership are taxed under personal tax rates no corporate tax rate is applied, so in the formulas sheet in rows 51 and 52, the formulas check if the tax applied will be business or individual, then checks the company structure for SP/Partnership, where applicable will and subract income amounts"]
[2.7,"2020-11-23","Jake Miller","3 minor points though we need to address:\n• Borrowing entity cell (row 13) – I’d recommend the following names:\no Individual\no Company (not business)\n• Reset button is not working\n• Business income page – When an amount is put in the “add back” section, lines 29-31, the whole section turns dark grey. Is this supposed to happen? \n","Updated borrower entity names in console\nReset button fixed\nFixed error in excel macro that was turning the income page dark grey from selection\nBug fix business income tax calc - Updated the tax calculation to move formula from applicant 1 into applicant 2-5"]
[2.8,"2020-12-09","Jake Miller","Change Request ffrom Ben Shirvani | Better Choice <Ben.s@betterchoice.com.au>: Bug in the warning code for external liabilites, asking to enter balance/ limit when Hecs/help, child maintence and rental expesne were selected.","Updated Cells R107 to R132 in the Input sheet to check if liabilities type is  Hecs/help, child maintence and rental expesne and if so do not display error."]
{"$rows_left_out":24}