{"text_format":"1","workbook":"xlsx","n_sheets":9,"sheets":["Main Menu","Guide","1_FX_PROOF","2_FX_CALCULATOR","HEM Drop In Tables","3_SERVICE","Calculations ","References","Version Control"],"not_rendered":{"charts":0,"images":5,"macros":1,"external_links":1,"defined_names":22,"comments":1,"pivot_tables":0},"unopened":[],"bounds":{"document_bytes":16777216,"sheet_cells":100000,"rows_first":2000,"rows_last":500,"rows_between":2000,"halvings":0,"cell_chars":16384,"cell_head_chars":4096},"cells_cut":0,"cells_raw":0,"read":"whole","date_system":"1900"}

{"sheet":"Main Menu","index":0,"n_rows":39,"n_cols":14,"rows_kept":39,"cut":false,"hidden":true,"merged":[]}
[]
[]
[]
[]
[]
[]
[]
[]
[]
[]
[]
[]
[null,null,null,null,null,null,null,null,null,null,null,null,null," "]
[]
[]
[]
[]
[]
[]
[]
{"$rows_left_out":20}
{"sheet":"Guide","index":1,"n_rows":32,"n_cols":11,"rows_kept":32,"cut":false,"hidden":false,"merged":[[0,10,1,16]]}
[null,null,null,null,null,null,null,null,null,null,"How To Guide - 3 Easy Steps"]
[]
[null,null,"STEP 1"]
[]
[null,null,"Obtain 30 day average rate from XE.com - copy and past the  FX Rate proof page  (see how to obtain rate and table to be used below)"]
[null,null,"Foreign Currency Exchange Rate - www.xe.com "]
[]
[]
[]
[]
[]
[]
[]
[]
[null,null,"STEP 2 "]
[null,null,"2) Complete the Rate table. Enter all the currencies and rates you will be using (obtained from XE.com and in proof page). Exchange rates provided in this section will be populated for the rest of the relative currency conversions."]
[null,null,"3) In ALL Cases, complete the  Base FX Income fields"]
[null,null,"4) FX Bonus: use this section if applicant earned bonuses for 2 consecutive years OR if you will be using the bonus and base income to calculate overtime (note - if 2 years overtime is to be calculated and NIL bonuses earnt then place \"0\" in the relative bonus fields)"]
[null,null,"5) Overtime: only use one of the three sections:  regular OT , OT by hour or OT by base and bonus. "]
[null,null,"6) Foreign Rental Income: complete as necessary "]
{"$rows_left_out":13}
{"sheet":"1_FX_PROOF","index":2,"n_rows":28,"n_cols":12,"rows_kept":28,"cut":false,"hidden":false,"merged":[]}
[]
[]
[]
[]
[]
[]
[]
[]
[]
[]
[]
[null,"Foreign Currency Exchange Rate - www.xe.com "]
[]
[]
[]
[]
[]
[]
[]
[]
{"$rows_left_out":9}
{"sheet":"2_FX_CALCULATOR","index":3,"n_rows":97,"n_cols":12,"rows_kept":97,"cut":false,"hidden":false,"merged":[]}
[{"$f":"Guide!Z1","v":0},null,"Version: 26 Oct 2018"]
[]
["Applicant 1"]
["Applicant 2",null,null,"Rate Table"]
["Applicant 3",null,null,"Currency","30-D Avg Rate (Base=AUD)"]
["Applicant 4",null,null,"Select"]
["Select",null,null,"Select"]
["AED",8.3539820174679966E-2,80,"Select"]
["BDT",null,80,"Select"]
["BND","wrong",90,"Select"]
["CAD",6.2756955910968207E-2,90,"Foreign Currency Exchange Rate - www.xe.com "]
["CHF",8.0407995668574622E-2,90]
["CNY",7.9805182345515743E-2,90,null,"Applicant 1","Applicant 2","Applicant 3","Applicant 4"]
["DKK",6.1699999999999998E-2,90,"1. Base FX Income"]
["EUR",6.7376081918175304E-2,90,"Currency","Select","Select","Select","Select"]
["FJD"," ",90,"30-D Avg Rate",{"$f":"IF(E15=\"Select\",\"\",IFERROR(VLOOKUP(E15,$D$6:$E$10,2,FALSE),\"RATE TABLE\"))","v":""},{"$f":"IF(F15=\"Select\",\"\",IFERROR(VLOOKUP(F15,$D$6:$E$10,2,FALSE),\"RATE TABLE\"))","v":""},"",""]
["GBP",8.9953254343893604E-2,90,"Income Cycle","Select","Select","Select","Select"]
["HKD",8.3122723356967396E-2,90,"Pay Per Cycle"]
["IDR",9.5355306729240585E-2,90,"Annualized Income",{"$f":"IFERROR(VLOOKUP(E17,$A$54:$B$58,2,FALSE)*E18,\"\")","v":""},{"$f":"IFERROR(VLOOKUP(F17,$A$54:$B$58,2,FALSE)*F18,\"\")","v":""},{"$f":"IFERROR(VLOOKUP(G17,$A$54:$B$58,2,FALSE)*G18,\"\")","v":""},{"$f":"IFERROR(VLOOKUP(H17,$A$54:$B$58,2,FALSE)*H18,\"\")","v":""}]
["INR",8.4628678109924249E-2,90,"Shading",{"$f":"VLOOKUP(E15,$A$7:$C$45,3,FALSE)","v":0},{"$f":"VLOOKUP(F15,$A$7:$C$45,3,FALSE)","v":0},0,0]
{"$rows_left_out":78}
{"sheet":"HEM Drop In Tables","index":4,"n_rows":19,"n_cols":19,"rows_kept":19,"cut":false,"hidden":true,"merged":[]}
["Low","Select","Couple","Couple with 1 child","Couple with 2 children","Couple with 3 or more children","Single person","Single parent with 1 child","Single parent with 2 children","Single parent with 3 or more children","Household 1","Household 2","Household 3","Household 4","Band","Household 1","Household 2","Household 3","Household 4"]
[0,23000,516.95148000559584,609.65214463457835,676.96482952823135,755.28226612326114,259.99190627137324,370.50979126243487,471.31053000177798,603.14103346604566,{"$f":"'3_SERVICE'!J17","v":0},{"$f":"'3_SERVICE'!J18","v":0},{"$f":"'3_SERVICE'!J19","v":0},{"$f":"'3_SERVICE'!J20","v":0},1,{"$f":"IF(AND(K2>=$A2,K2<$B2),1,0)*$O2","v":1},{"$f":"IF(AND(L2>=$A2,L2<$B2),1,0)*$O2","v":1},{"$f":"IF(AND(M2>=$A2,M2<$B2),1,0)*$O2","v":1},{"$f":"IF(AND(N2>=$A2,N2<$B2),1,0)*$O2","v":1}]
[23000,34000,516.95148000559584,609.65214463457835,676.96482952823135,755.28226612326114,277.00355171872371,370.50979126243487,471.31053000177798,603.14103346604566,{"$f":"K2","v":0},{"$f":"L2","v":0},0,0,{"$f":"O2+1","v":2},0,0,0,0]
[34000,46000,530.68083453477061,609.65214463457835,676.96482952823135,755.28226612326114,290.67660425050025,384.07905085807886,484.92934684414752,603.14103346604566,{"$f":"K3","v":0},{"$f":"L3","v":0},{"$f":"M3","v":0},{"$f":"N3","v":0},{"$f":"O3+1","v":3},0,0,0,0]
[46000,57000,550.54693318520071,629.44327474977445,696.79833740859317,755.28226612326114,310.46127975017089,403.7134842831739,504.63549969479521,623.47995229867797,0,0,0,0,4,0,0,0,0]
[57000,69000,584.57925447728576,663.34716854722274,730.77482793200852,789.21509744980494,344.3540575432188,437.3489510507884,538.39382019068489,658.32224684495202,0,0,0,0,5,0,0,0,0]
[69000,92000,638.15997466862098,716.7256824725356,784.26768440476462,842.63926498281467,397.71513176871849,490.30486075535669,591.54315164814136,713.17819448617797,0,0,0,0,6,0,0,0,0]
[92000,115000,713.44587325597854,791.72743872695469,859.43003819934734,917.70511738680636,472.69238536334029,564.71284245815059,666.22290891536454,790.25590632512012,0,0,0,0,7,0,0,0,0]
[115000,138000,780.7613501287866,858.78897910229739,926.63508255757836,984.82396824042462,539.7319469315122,631.24339170711085,732.99641587371616,859.17345252403845,0,0,0,0,8,0,0,0,0]
[138000,161000,863.86228288531163,941.57625972062181,1009.5997230400737,1067.6819984809742,622.4921511552991,713.37522124429518,815.42828695958872,944.25225360576917,0,0,0,0,9,0,0,0,0]
[161000,184000,894.06899069216729,971.66897671939944,1039.756876080995,1097.8004325747388,652.57506257149203,743.22968541312139,845.39179472379999,975.17788461538453,0,0,0,0,10,0,0,0,0]
[184000,229000,943.74098312981289,1021.1535223623459,1089.3473072733045,1147.3272674785967,702.04340553871475,792.32246558434701,894.66386835015703,1026.0320575420674,0,0,0,0,11,0,0,0,0]
[229000,287000,1066.6008763118248,1143.5497801626493,1212.0057193624145,1269.8281794170859,824.39965070711571,913.74971272131404,1016.5346473742161,1151.8161057692309,0,0,0,0,12,0,0,0,0]
[287000,344000,1194.1558360034776,1270.6234232867109,1339.3513490946682,1397.0103459218612,951.43169660957574,1039.817204178865,1143.0626010411027,1282.4068509615386,0,0,0,0,13,0,0,0,0]
[344000,99999999999,1210.3486086674106,1286.7550528673733,1355.5176304138038,1413.1557980973309,967.55808671863429,1055.8211511955478,1159.1250025627194,1298.9850135216348,0,0,0,0,14,0,0,0,0]
[null,null,null,null,null,null,null,null,null,null,null,null,null,null,"Final Band",{"$f":"SUM(P2:P15)","v":1},{"$f":"SUM(Q2:Q15)","v":1},1,1]
[null,null,null,null,null,null,null,null,null,null,null,null,null,null,null,{"$f":"Q16","v":1}]
[null,null,null,null,null,null,null,null,null,null,null,null,null,null,null,{"$f":"R16","v":1}]
[null,null,null,null,null,null,null,null,null,null,null,null,null,null,null,{"$f":"S16","v":1}]

{"sheet":"3_SERVICE","index":5,"n_rows":88,"n_cols":33,"rows_kept":88,"cut":false,"hidden":false,"merged":[[23,1,24,2],[2,1,3,2],[11,1,11,2],[21,1,21,2],[48,1,48,2],[13,1,14,2],[33,1,33,2],[34,1,34,2],[38,1,38,2],[35,1,35,2],[36,1,36,2],[37,1,37,2],[80,1,81,2],[71,1,72,2],[69,1,69,2],[66,3,66,4],[67,3,67,4],[63,4,63,5],[61,4,61,5],[59,1,59,2],[57,1,58,2],[50,1,51,2],[55,1,55,2]]}
[]
[]
[null,"Proposed Loan",null,null,null,null,null,null,null,null,null,null,null,null,null,null,null,null,"Applicant 1","Applicant 2","Applicant 3","Applicant 4","Low","End","Accu","Rate","Applicant 1","Applicant 2","Applicant 3","Applicant 4","Low","End","Rate"]
[null,null,null,null,null,null,"ADD INTEREST RATE BELOW:",null,null,null,null,null,null,null,null,null,null,null,{"$f":"D43","v":0},{"$f":"E43","v":0},{"$f":"F43","v":0},{"$f":"G43","v":0},0,18200,0,0,{"$f":"IF(AND(S4>=$W4,S4<=$X4),1,0)","v":1},{"$f":"IF(AND(T4>=$W4,T4<=$X4),1,0)","v":1},{"$f":"IF(AND(U4>=$W4,U4<=$X4),1,0)","v":1},{"$f":"IF(AND(V4>=$W4,V4<=$X4),1,0)","v":1},{"$f":"W4","v":0},{"$f":"X4","v":18200},0]
[null,"Loan Amount ",null,null,null,"Interest Rate",4.7800000000000002E-2,null,null,null,null,null,null,null,null,null,null,null,{"$f":"S4","v":0},{"$f":"T4","v":0},{"$f":"U4","v":0},{"$f":"V4","v":0},18200,37000,0,0.19,{"$f":"IF(AND(S5>$W5,S5<=$X5),1,0)","v":0},0,0,0,{"$f":"W5","v":18200},37000,0.19]
[null,"Loan Term (years)","Select",null,"EXPAT? BOOL",{"$f":"IFERROR(FIND(\"EXPAT\",#REF!),0)","v":0},null,null,null,null,null,null,null,null,null,null,null,null,{"$f":"S5","v":0},0,0,0,37000,90000,3572,0.32500000000000001,0,0,0,0,37000,90000,0.32500000000000001]
[null,"Margin",null,null,null,null,null,null,null,null,null,null,null,null,null,null,null,null,0,0,0,0,90000,180000,20797,0.37,0,0,0,0,90000,180000,0.37]
[null,"Deal LVR",null,null,null,null,null,null,null,null,null,null,null,null,null,null,null,null,0,0,0,0,180000,999999999,54097,0.45,0,0,0,0,180000,999999999,0.45]
[null,"Actual Interest Rate",{"$f":"G5+C7","v":4.7800000000000002E-2},null,null,null,null,null,null,null,null,null,null,null,null,null,null,null,{"$f":"SUMPRODUCT(--(AA4:AA8=1)*Y4:Y8)+VLOOKUP(1,AA4:AH8,7,FALSE)*(S4-VLOOKUP(1,AA4:AH8,5,FALSE))","v":0},{"$f":"SUMPRODUCT(--(AB4:AB8=1)*Y4:Y8)+VLOOKUP(1,AB4:AI8,6,FALSE)*(T4-VLOOKUP(1,AB4:AI8,4,FALSE))","v":0},{"$f":"SUMPRODUCT(--(AC4:AC8=1)*Y4:Y8)+VLOOKUP(1,AC4:AJ8,5,FALSE)*(U4-VLOOKUP(1,AC4:AJ8,3,FALSE))","v":0},{"$f":"SUMPRODUCT(--(AD4:AD8=1)*Y4:Y8)+VLOOKUP(1,AD4:AK8,4,FALSE)*(V4-VLOOKUP(1,AD4:AK8,2,FALSE))","v":0}]
[null,"Actual  Repayment ",{"$f":"IFERROR(PMT(C9/12,C6*12,C5,0),0)","v":0}]
[null,"Assessment Rate ",{"$f":"References!B30","v":7.7800000000000008E-2}]
[null,"Assessed Monthly Repayment ",null,{"$f":"IFERROR('Calculations '!A6,0)","v":0}]
[]
[null,"Living Expenses "]
[]
[null,"Select","Description","Has at least one child <14? (Family allowance)","HEM Monthly Living Expense","Declared Living Expense","Assessed Living Expense"]
[null,"Household 1","Select","Select",{"$f":"IFERROR(HLOOKUP(C17,'HEM Drop In Tables'!$C$1:$J$15,'HEM Drop In Tables'!P16+1,FALSE)*52/12,0)","v":0},null,{"$f":"MAX(E17,F17)","v":0},null,null,{"$f":"SUMIF($D$24:$G$24,B17,$D$48:$G$48)","v":0},{"$f":"IF(AND(F17<>\"\",F17<E17),\"WARNING - The monthly living expenses are below benchmark. Detailed explanation required\",\"\")","v":""}]
[null,"Household 2","Select","Select",{"$f":"IFERROR(HLOOKUP(C18,'HEM Drop In Tables'!$C$1:$J$15,'HEM Drop In Tables'!P17+1,FALSE)*52/12,0)","v":0},null,{"$f":"MAX(E18,F18)","v":0},null,null,{"$f":"SUMIF($D$24:$G$24,B18,$D$48:$G$48)","v":0},{"$f":"IF(AND(F18<>\"\",F18<E18),\"WARNING - The monthly living expenses are below benchmark. Detailed explanation required\",\"\")","v":""}]
[null,"Household 3","Select","Select",{"$f":"IFERROR(HLOOKUP(C19,'HEM Drop In Tables'!$C$1:$J$15,'HEM Drop In Tables'!P18+1,FALSE)*52/12,0)","v":0},null,0,null,null,{"$f":"SUMIF($D$24:$G$24,B19,$D$48:$G$48)","v":0},""]
[null,"Household 4","Select","Select",{"$f":"IFERROR(HLOOKUP(C20,'HEM Drop In Tables'!$C$1:$J$15,'HEM Drop In Tables'!P19+1,FALSE)*52/12,0)","v":0},null,0,null,null,{"$f":"SUMIF($D$24:$G$24,B20,$D$48:$G$48)","v":0},""]
{"$rows_left_out":69}
{"sheet":"Calculations ","index":6,"n_rows":350,"n_cols":19,"rows_kept":350,"cut":false,"hidden":true,"merged":[[18,0,19,1]]}
["Assessed Monthly Repayment",null,null,null,null,null,null,null,null,"Actual Repayment"]
["Loan Amount ",{"$f":"'3_SERVICE'!C5","v":0},null,null,null,null,null,null,null,"Loan Amount ",{"$f":"'3_SERVICE'!C5","v":0}]
["Loan Term (years)",{"$f":"'3_SERVICE'!C6","v":"Select"},{"$f":"B3*12","v":{"$error":"#VALUE!"}},null,null,null,null,null,null,"Loan Term (years)",{"$f":"'3_SERVICE'!C6","v":"Select"},{"$f":"K3*12","v":{"$error":"#VALUE!"}}]
["Assessment Rate ",{"$f":"'3_SERVICE'!C11","v":7.7800000000000008E-2},{"$f":"B4/12","v":6.483333333333334E-3},null,null,null,null,null,null,"Actual Rate",{"$f":"'3_SERVICE'!C9","v":4.7800000000000002E-2},{"$f":"K4/12","v":3.9833333333333335E-3}]
["Repayment",null,null,null,null,null,null,null,null,"Repayment"]
[{"$f":"-PMT(C4,C3,B2,0)","v":{"$error":"#VALUE!"}},null,null,null,null,null,null,null,null,{"$f":"-PMT(L4,L3,K2)","v":{"$error":"#VALUE!"}}]
[]
["MBC "]
["Loan Term (years)",{"$f":"'3_SERVICE'!C6","v":"Select"},{"$f":"B9*12","v":{"$error":"#VALUE!"}}]
["Assessment Rate ",{"$f":"'3_SERVICE'!C11","v":7.7800000000000008E-2},{"$f":"B10/12","v":6.483333333333334E-3}]
["Surplus / Deficit",{"$f":"'3_SERVICE'!C78","v":0},{"$f":"'3_SERVICE'!C74-'3_SERVICE'!C75-'3_SERVICE'!C77-1","v":-1}]
["Maximum Borrowing Capacity "]
[{"$f":"-PV(C10,C9,C11)","v":{"$error":"#VALUE!"}}]
[]
[]
["Income "]
[]
[]
["Annual Income"]
[null,null,"Applicant 1","Applicant 2","Applicant 3","Applicant 4","Taxable ",null,null,"Applicant 1 Taxable Income ","Applicant 2 Taxable Income ","Applicant 3 Taxable Income ","Applicant 4 Taxable Income ",null,null,"Applicant 1 Taxable Income ","Applicant 2 Taxable Income ","Applicant 3 Taxable Income ","Applicant 4 Taxable Income "]
{"$rows_left_out":331}
{"sheet":"References","index":7,"n_rows":62,"n_cols":42,"rows_kept":62,"cut":false,"hidden":true,"merged":[[0,4,0,7]]}
["Foreign Exchange Haircut",0.9,null,null,"Dropdowns ",null,null,null,null,"Spouse ",null,null,null,null,null,null,null,null,null,null,null,null,null,null,"Promo Codes"]
["Income",null,null,null,null,"No of Dependants ","TAX Deductible ","Select",null,"Applicant 1","Applicant 2","Applicant 3","Applicant 4",null,"Marital Status ",null,"Loan Purpose",null,null,null,"Employment Type",null,"Assets",null,"None",null,"Income Type",null,"Product Type",null,"Applicant Type",null,"Product Definition","Base Rate","Is PL","Residency Status",null,"Applicant",null,"Repayment Type",null,"Frequency"]
["Type","Percentage Accepted of Gross","Taxed ",null,null,0,"Yes ",30,null,"Applicant 2","Applicant 1","Applicant 1","Applicant 1",null,"NA",null,"Home Extension / Improvement",null,null,null,"Full time PAYG",null,"Owner Occupied Property",null,"Establishment Fee Waiver - Promo til 30-6-17",null,"Gross",null,"Personal Loan Unsecured",null,"Internal Pioneer",null,"Select",0,"N","Aust/NZ citizen",null,"Applicant 1",null,"Interest Only",null,"Weekly"]
[{"$f":"'3_SERVICE'!B26","v":"Gross PAYG (Full time, part time, contract)"},{"$f":"100%","v":1},"Yes",null,null,1,"No",29,null,"Applicant 3","Applicant 3","Applicant 2","Applicant 2",null,"Single",null,"Household Appliances / Furniture",null,null,null,"Part time PAYG",null,"Investment Property",null,"Establishment Fee Waiver- GMY CEO",null,"Net",null,"Personal Loan Mortgage Secured",null,"External Pioneer",null,"CAR.LOAN.3Y",5.99,"Y","Permanent Resident",null,"Applicant 2",null,"Principal and Interest",null,"Fortnightly"]
[{"$f":"'3_SERVICE'!B27","v":"Gross Casual or Temp Income"},{"$f":"100%","v":1},"Yes",null,null,2,null,28,null,"Applicant 4","Applicant 4","Applicant 4","Applicant 3",null,"Married",null,"Debt Consolidation",null,null,null,"Casual",null,"Vehicle",null,null,null,null,null,"Personal Loan Other Secured",null,"Staff Pioneer",null,"CAR.LOAN.3Y.MORE",7.49,"Y","Temporary Resident",null,"Applicant 1 and 2",null,null,null,"Monthly"]
[{"$f":"'3_SERVICE'!B28","v":"Gross Overtime "},0.8,"Yes",null,null,3,null,27,null,"Not in application","Not in application","Not in application","Not in application",null,"De-Facto",null,"Travel",null,null,null,"Contract",null,"Contents",null,null,null,null,null,"Home Loans/Investment Pty Loan",null,"Bare Money",null,"PL.MORTGAGE.SEC",5.5,"Y","Non resident",null,null,null,null,null,"Quarterly"]
[{"$f":"'3_SERVICE'!B29","v":"Gross Bonuses "},0.8,"Yes",null,null,4,null,26,null,null,null,null,null,null,"Divorced",null,"Education",null,null,null,"Temp",null,"Savings",null,null,null,null,null,null,null,null,null,"PL.OTHER.SEC",10.3,"Y",null,null,null,null,null,null,"Annual"]
[{"$f":"'3_SERVICE'!B30","v":"Gross Commissions"},0.8,"Yes",null,null,5,null,25,null,null,null,null,null,null,"Separated",null,"Litigation costs",null,null,null,"Self Employed",null,"Investments",null,null,null,null,null,null,null,null,null,"PL.UNSECURED",12.99,"Y"]
[{"$f":"'3_SERVICE'!B31","v":"Employer allowances"},{"$f":"100%","v":1},"Yes",null,null,6,null,24,null,null,null,null,null,null,"Widowed",null,"Living Expenses",null,null,null,null,null,"Super",null,null,null,null,null,null,null,null,null,"HL.OWNER.OCCUPIER",4.75,"N"]
[{"$f":"'3_SERVICE'!B32","v":"Rental Income"},0.8,"No",null,null,7,null,23,null,null,null,null,null,null,null,null,"Wedding/Honeymoon",null,null,null,null,null,"Other",null,null,null,null,null,null,null,null,null,"HL.INVESTMENT",4.95,"N"]
[{"$f":"'3_SERVICE'!#REF!","v":{"$error":"#REF!"}},0.8,"No",null,null,8,null,22,null,null,"State",null,null,null,null,null,"Deposit for house",null,null,null,null,null,null,null,null,null,null,null,null,null,null,null,"HL.BRIDGING",4.75,"N"]
[{"$f":"'3_SERVICE'!B33","v":"Investment Income "},0.8,"Yes",null,null,9,null,21,null,null,"ACT",null,null,null,null,null,"Owner occupied property purchase",null,null,null,null,null,null,null,null,null,null,null,null,null,null,null,"HL.CONSTRUCTION",4.75,"N"]
[{"$f":"'3_SERVICE'!B34","v":"Government Pension"},1,"No",null,null,10,null,20,null,null,"NSW",null,null,null,null,null,"Property construction",null,null,null,null,null,null,null,null,null,null,null,null,null,null,null,"SMSF.LOAN.RESIDENTIAL",4.75,"N"]
[{"$f":"'3_SERVICE'!B35","v":"Family Allowance/Childcare support/Child maintenance"},1,"No",null,null,11,null,19,null,null,"NT",null,null,null,null,null,"Investment property",null,null,null,null,null,null,null,null,null,null,null,null,null,null,null,"SMSF.LOAN.COMMERCIAL",5.99,"N"]
[{"$f":"'3_SERVICE'!B40","v":0},0,"Yes",null,null,12,null,18,null,null,"QLD",null,null,null,null,null,"Vacant Land",null,null,null,null,null,null,null,null,null,null,null,null,null,null,null,"BUSINESS.LOAN.COMM",5.99,"N"]
[{"$f":"'3_SERVICE'!B41","v":"Other Income "},{"$f":"100%*B1","v":0.9},"Yes",null,null,null,null,17,null,null,"SA",null,null,null,null,null,"Refinance",null,null,null,null,null,null,null,null,null,null,null,null,null,null,null,"BUSINESS.LOAN.RESDENT",4.75,"N"]
["NPBT",1,"Yes",null,null,null,null,16,null,null,"TAS",null,null,null,null,null,"Bridging finance",null,null,null,null,null,null,null,null,null,null,null,null,null,null,null,"Better Choice Owner Occ 90%",3.8,"N"]
["Interest Add Back",1,"No",null,null,null,null,15,null,null,"VIC",null,null,null,null,null,"Other",null,null,null,null,null,null,null,null,null,null,null,null,null,null,null,"<EXPAT>Better Choice Inv P&I 80%",2.89,"N"]
["Depreciation Add Back",0.5,"No",null,null,null,null,14,null,null,"WA",null,null,null,null,null,"Business Purpose",null,null,null,null,null,null,null,null,null,null,null,null,null,null,null,"<EXPAT>Better Choice Inv I/O 80%",3.14,"N"]
["Gross Salary Add Back",1,"Yes",null,null,null,null,13,null,null,null,null,null,null,null,null,"Investment - Non residential property",null,null,null,null,null,null,null,null,null,null,null,null,null,null,null,"<EXPAT>Better Choice Owner Occ 80%",3.39,"N"]
{"$rows_left_out":43}
{"sheet":"Version Control","index":8,"n_rows":8,"n_cols":6,"rows_kept":8,"cut":false,"hidden":true,"merged":[]}
["Version","Date","Change Requestor","Changee","Change Requests","Changes"]
[1.1000000000000001,"2020-12-01","Gloria Mudge","Jake Miller","Could you please look to adjust the servicing calculator so shading at converted rate is now at 90% as per standard Expat policy? \n\nThe following will also need to be adjusted \n\n Assessment rate 5.25% \n Please review the HEM figures (I think there was a 5% loading which should remain in place)\n","Assessment Rate changed from 5.4% to 5.25% on references sheet cell B30\nFor HEM as if Q2 Figures, average HEM over couple across all income bands actually reduced, therefore not greater than 5% tolerance level and does not need to be updated.\nUpdated shading for foreign income, C10:C54 changing from 80 to 90 to reducing shading on foreign incomes.\n"]
[1.1200000000000001,"2021-03-04","Gloria Mudge","Nick Chong","Please see below updated rates to amend …\n \n•\tINV PI 70% = 2.90%\n•\tINV IO 70% = 3.10%\n•\tINV PI 80% = 3.10%\n•\tINV IO 80% = 3.30%","Updated rates"]
[1.2,"2021-08-25","Kevin Lee","Jake Miller","From: Kevin Lee | Better Choice <Kevin.L@betterchoice.com.au> \nSent: Thursday, 12 August 2021 6:13 AM\nTo: Jake Miller <jake.miller@bnk.com.au>\nSubject: Expat Servicing Calculator \nImportance: High\n \nHi Jake,\n \nOverlooked getting the Gold Expat Servicing Calculator rates updated with the last rate change.\n \nAre you able to update please to below rates at your earliest convenience as always we have a deal in to progress.\n \n ","Updated references sheet to change Base rate of core products as per picture on the right."]
[1.3,"2021-10-21","Gloria Mudge","Jean du Plessis","Jira ticket: https://betterchoice.atlassian.net/jira/servicedesk/projects/SD/queues/custom/49/SD-1069\nChange requested by Gloria Mudge.\nAssesment rate to be increased from 5.25% to 5.75%","Updated References Cell B30. Left percentage of 5.25 AS IS.\nUpdated 2.5% to 3%\nFormula changed from:\n=MAX(5.25%,'3_SERVICE'!C9+2.5%)\nTO:\n=MAX(5.25%,'3_SERVICE'!C9+3%)\n\nUpdated Rates on References sheet (AG32:AH35)\nFROM:\n<EXPAT>Better Choice Inv P&I 80% 2Y Fixed:\t2.49\n<EXPAT>Better Choice Inv IO 80% 2Y Fixed:\t2.79\n<EXPAT>Better Choice Inv P&I 80% 3Y Fixed:\t2.69\n<EXPAT>Better Choice Inv IO 80% 3Y Fixed:\t2.99\n\nTO:\n<EXPAT>Better Choice Inv P&I 80% 2Y Fixed:\t2.59\n<EXPAT>Better Choice Inv IO 80% 2Y Fixed:\t2.89\n<EXPAT>Better Choice Inv P&I 80% 3Y Fixed:\t2.79\n<EXPAT>Better Choice Inv IO 80% 3Y Fixed:\t3.04\n\n"]
[4.0999999999999996,"2022-03-01",null,"BCHL","See Ticket SD-1080","Cap at zero"]
[4.2,"2022-07-07","Gloria Mudge","Nick Chong","•\tHEM Income thresholds to be updated on each calculator as these have adjusted since the last HEM update (2022 figures) \n•\tVersion control numbers to be updated on each calculator \n•\tPlease also update the internal Ultimate calculator which includes the subordination calculator with the 3% buffer and HEM figures. \n•\tAll calculators are to be locked once finalised. ","Updated HEM according to the 2022 figures"]
[4.2,"2022-07-21","Jake Miller","Jake Miller","Fix #Ref Issue and reset button","Appears that a row was deleted out of the calculator where you could toggle between yes and no, this was used in the vlookups for 3_service in range G61:68, therefore updated the if statements to always be \"Y\"\n\nIn the defined named range, the range \"Service drop down\" also referenced this space, so the code would not execute, so within the defined name range deleted the reference to the #ref cell."]