{"text_format":"1","workbook":"xlsx","n_sheets":26,"sheets":["Commercial","CommercialBetterChoice","Residential","SEIC","HEM Table","Validation","Tax Table","Inputs","Data","CommercialData","CommercialDataBetterChoice","TestCases","CommercialTestCases","CommercialTestCasesBetterChoice","User Guide - Residential","User Guide - SEIC","User Guide - Commercial","Assessment Notes - Residential","Assessment Notes - Commercial","Conditions","Cashflow Sensitivity Model","YTD","Workings","Rental Schedule","BBS & BAS","Version Control"],"not_rendered":{"charts":0,"images":8,"macros":1,"external_links":1,"defined_names":180,"comments":9,"pivot_tables":0},"unopened":[],"bounds":{"document_bytes":16777216,"sheet_cells":100000,"rows_first":2000,"rows_last":500,"rows_between":2000,"halvings":0,"cell_chars":16384,"cell_head_chars":4096},"cells_cut":0,"cells_raw":0,"read":"whole","date_system":"1900"}

{"sheet":"Commercial","index":0,"n_rows":89,"n_cols":17,"rows_kept":89,"cut":false,"hidden":false,"merged":[[31,2,32,2],[3,4,3,8],[88,8,88,10],[87,8,87,10],[53,6,53,8],[54,6,54,8],[55,6,55,8],[56,6,56,8],[57,6,57,8]]}
[null,"Commercial Servicability Calculator"]
[null,null,{"$f":"Residential!C3","v":"Version 5.8 (16 August 2021)"}]
[]
[null,null,"Applicant Name"]
[]
[null,null,"Proposed Loan Details"]
[]
[null,null,"New Loan Amount",null,null,null,"Interest Rate"]
[null,null,"Documentation Type",null,null,null,"Loan Term (Years)"]
[null,null,null,null,null,null,"I/O Term (Years)"]
[null,null,null,null,null,null,"P&I Repayment",null,{"$f":"IF(I9>I10,-PMT(I8/12,12*(I9-I10),E8),0)","v":0}]
[null,null,null,null,null,null,"IO Repayment",null,{"$f":"IF(I10>0,E8*I8/12,0)","v":0}]
[]
[]
[null,null,"Business Loan Details",null,null,null,null,null,null,null,null,null,null,"excluding proposed Pepper loan"]
[]
[null,null,null,null,"Loan Amount",null,"Rate",null,"Actual Loan Repayment (Monthly)"]
[null,null,"Loan 1"]
[null,null,"Loan 2"]
[null,null,"Loan 3"]
[null,null,"Loan 4"]
[]
[]
[null,null,"Business Income / Expenses"]
[]
[null,null,"Business Income",null,null,null,null,null,"Add Backs"]
[null,null,"Net Profit Before Tax",null,null,null,null,null,"Depreciation"]
[null,null,"Proposed Net CRE Rental Income",null,null,null,null,null,"Ammortisation"]
[null,null,"Proposed Gross Residential Rental Income",null,null,null,null,null,"Interest Paid"]
[null,null,null,null,null,null,null,null,"Directors Salaries/Fees/Super"]
[null,null,null,null,null,null,null,null,"Other"]
[null,null,"Earning Before Interest, Tax, Depreciation & Ammortisation (EBITDA)"]
[null,null,null,null,{"$f":"K33+E27+E28+(E29*RentalIncomeShading)","v":0},null,null,null," Total Add Backs",null,{"$f":"SUM(K27:K31)","v":0}]
[]
[]
[null,null,"Personal Income / Expenses"]
[]
[null,null,"Applicant Details",null,"Applicant 1",null,"Applicant 2",null,"Applicant 3",null,"Applicant 4"]
[null,null,"Status"]
[null,null,"Couple With"]
[null,null,"Dependants"]
[null,null,null,null,"Enter a Status",null,"Enter a Status",null,"Enter a Status",null,"Enter a Status"]
[]
[null,null,"Gross Annual Income"]
[null,null,"Untaxed Allowable Income"]
[null,null,"Gross Residential Rental Income (Other)"]
[null,null,"Total Income",null,{"$f":"E44+E45+E46*RentalIncomeShading","v":0},null,{"$f":"G44+G45+G46*RentalIncomeShading","v":0},null,{"$f":"I44+I45+I46*RentalIncomeShading","v":0},null,{"$f":"K44+K45+K46*RentalIncomeShading","v":0},null,null,null,null,{"$f":"(E47+G47+I47+K47)","v":0},"Total Gross Annual Income"]
[]
[null,null,"Investment Property Loan Balance (personal name)"]
[null,null,"Tax",null,{"$f":"VLOOKUP(E66,IncomeTaxTable,2,TRUE)+MAX(((E66-VLOOKUP(E66,IncomeTaxTable,1,TRUE))*VLOOKUP(E66,IncomeTaxTable,3,TRUE)),0) +IF(E66<=MinimumForPartialLevy,0,IF(E66>MinimumForFullLevy,E66*MedicareFullLevyPerc,(E66-MinimumForPartialLevy)*MedicarePartialLevyPerc))","v":0},null,{"$f":"VLOOKUP(G66,IncomeTaxTable,2,TRUE)+MAX(((G66-VLOOKUP(G66,IncomeTaxTable,1,TRUE))*VLOOKUP(G66,IncomeTaxTable,3,TRUE)),0) +IF(G66<=MinimumForPartialLevy,0,IF(G66>MinimumForFullLevy,G66*MedicareFullLevyPerc,(G66-MinimumForPartialLevy)*MedicarePartialLevyPerc))","v":0},null,{"$f":"VLOOKUP(I66,IncomeTaxTable,2,TRUE)+MAX(((I66-VLOOKUP(I66,IncomeTaxTable,1,TRUE))*VLOOKUP(I66,IncomeTaxTable,3,TRUE)),0) +IF(I66<=MinimumForPartialLevy,0,IF(I66>MinimumForFullLevy,I66*MedicareFullLevyPerc,(I66-MinimumForPartialLevy)*MedicarePartialLevyPerc))","v":0},null,{"$f":"VLOOKUP(K66,IncomeTaxTable,2,TRUE)+MAX(((K66-VLOOKUP(K66,IncomeTaxTable,1,TRUE))*VLOOKUP(K66,IncomeTaxTable,3,TRUE)),0) +IF(K66<=MinimumForPartialLevy,0,IF(K66>MinimumForFullLevy,K66*MedicareFullLevyPerc,(K66-MinimumForPartialLevy)*MedicarePartialLevyPerc))","v":0}]
[null,null,"Tax offset for Low Income Earners",null,{"$f":"0-(IF(E39=\"Company\",0,MIN(E50,IF(OR(E66<=0,E66>=TaxOffsetMaximumEntitlement),0,TaxOffsetForLowIncomeEarners-IF(E66>TaxOffsetIncomeThreshholds,((E66-TaxOffsetIncomeThreshholds)*TaxOffSetReducedByPerc),0))))+IF(OR(E39=\"Company\",E66=\"\",E66=0),0,IF(VLOOKUP(E66,TaxOffsetForLowIncomeTable,2,TRUE)+(E66-VLOOKUP(E66,TaxOffsetForLowIncomeTable,1,TRUE))*VLOOKUP(E66,TaxOffsetForLowIncomeTable,3,TRUE)<0,0,VLOOKUP(E66,TaxOffsetForLowIncomeTable,2,TRUE)+(E66-VLOOKUP(E66,TaxOffsetForLowIncomeTable,1,TRUE))*VLOOKUP(E66,TaxOffsetForLowIncomeTable,3,TRUE))))","v":0},null,{"$f":"0-(IF(G39=\"Company\",0,MIN(G50,IF(OR(G66<=0,G66>=TaxOffsetMaximumEntitlement),0,TaxOffsetForLowIncomeEarners-IF(G66>TaxOffsetIncomeThreshholds,((G66-TaxOffsetIncomeThreshholds)*TaxOffSetReducedByPerc),0))))+IF(OR(G39=\"Company\",G66=\"\",G66=0),0,IF(VLOOKUP(G66,TaxOffsetForLowIncomeTable,2,TRUE)+(G66-VLOOKUP(G66,TaxOffsetForLowIncomeTable,1,TRUE))*VLOOKUP(G66,TaxOffsetForLowIncomeTable,3,TRUE)<0,0,VLOOKUP(G66,TaxOffsetForLowIncomeTable,2,TRUE)+(G66-VLOOKUP(G66,TaxOffsetForLowIncomeTable,1,TRUE))*VLOOKUP(G66,TaxOffsetForLowIncomeTable,3,TRUE))))","v":0},null,{"$f":"0-(IF(I39=\"Company\",0,MIN(I50,IF(OR(I66<=0,I66>=TaxOffsetMaximumEntitlement),0,TaxOffsetForLowIncomeEarners-IF(I66>TaxOffsetIncomeThreshholds,((I66-TaxOffsetIncomeThreshholds)*TaxOffSetReducedByPerc),0))))+IF(OR(I39=\"Company\",I66=\"\",I66=0),0,IF(VLOOKUP(I66,TaxOffsetForLowIncomeTable,2,TRUE)+(I66-VLOOKUP(I66,TaxOffsetForLowIncomeTable,1,TRUE))*VLOOKUP(I66,TaxOffsetForLowIncomeTable,3,TRUE)<0,0,VLOOKUP(I66,TaxOffsetForLowIncomeTable,2,TRUE)+(I66-VLOOKUP(I66,TaxOffsetForLowIncomeTable,1,TRUE))*VLOOKUP(I66,TaxOffsetForLowIncomeTable,3,TRUE))))","v":0},null,{"$f":"0-(IF(K39=\"Company\",0,MIN(K50,IF(OR(K66<=0,K66>=TaxOffsetMaximumEntitlement),0,TaxOffsetForLowIncomeEarners-IF(K66>TaxOffsetIncomeThreshholds,((K66-TaxOffsetIncomeThreshholds)*TaxOffSetReducedByPerc),0))))+IF(OR(K39=\"Company\",K66=\"\",K66=0),0,IF(VLOOKUP(K66,TaxOffsetForLowIncomeTable,2,TRUE)+(K66-VLOOKUP(K66,TaxOffsetForLowIncomeTable,1,TRUE))*VLOOKUP(K66,TaxOffsetForLowIncomeTable,3,TRUE)<0,0,VLOOKUP(K66,TaxOffsetForLowIncomeTable,2,TRUE)+(K66-VLOOKUP(K66,TaxOffsetForLowIncomeTable,1,TRUE))*VLOOKUP(K66,TaxOffsetForLowIncomeTable,3,TRUE))))","v":0}]
[null,null,"Net Income",null,{"$f":"E47-(IF(E50+E51>0,E50+E51,0))","v":0},null,{"$f":"G47-(IF(G50+G51>0,G50+G51,0))","v":0},null,{"$f":"I47-(IF(I50+I51>0,I50+I51,0))","v":0},null,{"$f":"K47-(IF(K50+K51>0,K50+K51,0))","v":0},null,null,null,null,{"$f":"(E52+G52+I52+K52)","v":0},"Total Net Annual Income"]
[]
[null,null,"Living Expenses (monthly)",null,null,null,"Other Commitments",null,null,null,"Per Month"]
[null,null,"Declared Living Expenses",null,null,null,"Rent/Board"]
[null,null,null,null,null,null,"Total Credit Card Limit",null,null,null,null,null,"3%:",{"$f":"K56*CreditCardCommitments","v":0}]
[null,null,null,null,null,null,"Personal Mortgage Repayments"]
[null,null,null,null,null,null,"Other Consumer Debt"]
[]
[null,null,"Is an Applicant",null,{"$f":"OR(E39<>\"\")","v":false},null,{"$f":"OR(G39<>\"\")","v":false},null,{"$f":"OR(I39<>\"\")","v":false},null,{"$f":"OR(K39<>\"\")","v":false}]
[null,null,"Spouse Dependants",null,{"$f":"IFERROR(HLOOKUP(E40,CREApplicantDetailsTable,4,FALSE),0)","v":0},null,{"$f":"IFERROR(HLOOKUP(G40,CREApplicantDetailsTable,4,FALSE),0)","v":0},null,{"$f":"IFERROR(HLOOKUP(I40,CREApplicantDetailsTable,4,FALSE),0)","v":0},null,{"$f":"IFERROR(HLOOKUP(K40,CREApplicantDetailsTable,4,FALSE),0)","v":0}]
[null,null,"Pepper Status Code",null,{"$f":"IF(E$39=\"Individual (Couple)\",\"P-C\",IF(E$39=\"Individual (Single)\",\"P-S\",\"\"))","v":""},null,{"$f":"IF(G$39=\"Individual (Couple)\",\"P-C\",IF(G$39=\"Individual (Single)\",\"P-S\",\"\"))","v":""},null,{"$f":"IF(I$39=\"Individual (Couple)\",\"P-C\",IF(I$39=\"Individual (Single)\",\"P-S\",\"\"))","v":""},null,{"$f":"IF(K$39=\"Individual (Couple)\",\"P-C\",IF(K$39=\"Individual (Single)\",\"P-S\",\"\"))","v":""}]
[null,null,"Pepper Dependents Code",null,{"$f":"IF(E$39=\"Individual (Couple)\",\"P-CD\"&INDEX(Validation!$B$21:$B$26,MATCH((E$41+E$61),Validation!$A$21:$A$26,1)),IF(E$39=\"Individual (Single)\",\"P-SD\"&INDEX(Validation!$B$21:$B$26,MATCH((E$41+E$61),Validation!$A$21:$A$26,1)),\"\"))","v":""},null,{"$f":"IF(G$39=\"Individual (Couple)\",\"P-CD\"&INDEX(Validation!$B$21:$B$26,MATCH((G$41+G$61),Validation!$A$21:$A$26,1)),IF(G$39=\"Individual (Single)\",\"P-SD\"&INDEX(Validation!$B$21:$B$26,MATCH((G$41+G$61),Validation!$A$21:$A$26,1)),\"\"))","v":""},null,{"$f":"IF(I$39=\"Individual (Couple)\",\"P-CD\"&INDEX(Validation!$B$21:$B$26,MATCH((I$41+I$61),Validation!$A$21:$A$26,1)),IF(I$39=\"Individual (Single)\",\"P-SD\"&INDEX(Validation!$B$21:$B$26,MATCH((I$41+I$61),Validation!$A$21:$A$26,1)),\"\"))","v":""},null,{"$f":"IF(K$39=\"Individual (Couple)\",\"P-CD\"&INDEX(Validation!$B$21:$B$26,MATCH((K$41+K$61),Validation!$A$21:$A$26,1)),IF(K$39=\"Individual (Single)\",\"P-SD\"&INDEX(Validation!$B$21:$B$26,MATCH((K$41+K$61),Validation!$A$21:$A$26,1)),\"\"))","v":""}]
[null,null,"Exclude for LE calc",null,{"$f":"IFERROR(IF(MATCH(E40,$E$38:$K$38,0)<(COLUMN()-COLUMN($E$38:$K$38)+1),TRUE,FALSE),FALSE)","v":false},null,{"$f":"IFERROR(IF(MATCH(G40,$E$38:$K$38,0)<(COLUMN()-COLUMN($E$38:$K$38)+1),TRUE,FALSE),FALSE)","v":false},null,{"$f":"IFERROR(IF(MATCH(I40,$E$38:$K$38,0)<(COLUMN()-COLUMN($E$38:$K$38)+1),TRUE,FALSE),FALSE)","v":false},null,{"$f":"IFERROR(IF(MATCH(K40,$E$38:$K$38,0)<(COLUMN()-COLUMN($E$38:$K$38)+1),TRUE,FALSE),FALSE)","v":false}]
[]
[null,null,"Total Taxable Income",null,{"$f":"MAX(E44+E46*RentalIncomeShading-E49*WorkingsForNegativeGearing,0)","v":0},null,{"$f":"MAX(G44+G46*RentalIncomeShading-G49*WorkingsForNegativeGearing,0)","v":0},null,0,null,0,null,null,null,null,{"$f":"(E66+G66+I66+K66)","v":0},"Total Taxable Income"]
[null,null,"Spouse Income",null,{"$f":"IFERROR(HLOOKUP(E40,CREApplicantDetailsTable,7,FALSE),0)","v":0},null,{"$f":"IFERROR(HLOOKUP(G40,CREApplicantDetailsTable,7,FALSE),0)","v":0},null,{"$f":"IFERROR(HLOOKUP(I40,CREApplicantDetailsTable,7,FALSE),0)","v":0},null,{"$f":"IFERROR(HLOOKUP(K40,CREApplicantDetailsTable,7,FALSE),0)","v":0}]
[null,null,"Income Bracket",null,{"$f":"IFERROR(HLOOKUP(E44+E67,HemCombinedIncomeRange,3,TRUE),1)","v":1},null,{"$f":"IFERROR(HLOOKUP(G44+G67,HemCombinedIncomeRange,3,TRUE),1)","v":1},null,{"$f":"IFERROR(HLOOKUP(I44+I67,HemCombinedIncomeRange,3,TRUE),1)","v":1},null,{"$f":"IFERROR(HLOOKUP(K44+K67,HemCombinedIncomeRange,3,TRUE),1)","v":1}]
[null,null,"HEM Living Expense",null,{"$f":"IFERROR(IF(AND(E60,NOT(E64)),(VLOOKUP(E62,HemTableForExpenses,E68+1,FALSE) +(VLOOKUP(E63,HemTableForExpenses,E68+1,FALSE))*(E41+E61))*NumberOfWeeksInAYear,0),0)","v":0},null,{"$f":"IFERROR(IF(AND(G60,NOT(G64)),(VLOOKUP(G62,HemTableForExpenses,G68+1,FALSE) +(VLOOKUP(G63,HemTableForExpenses,G68+1,FALSE))*(G41+G61))*NumberOfWeeksInAYear,0),0)","v":0},null,{"$f":"IFERROR(IF(AND(I60,NOT(I64)),(VLOOKUP(I62,HemTableForExpenses,I68+1,FALSE) +(VLOOKUP(I63,HemTableForExpenses,I68+1,FALSE))*(I41+I61))*NumberOfWeeksInAYear,0),0)","v":0},null,{"$f":"IFERROR(IF(AND(K60,NOT(K64)),(VLOOKUP(K62,HemTableForExpenses,K68+1,FALSE) +(VLOOKUP(K63,HemTableForExpenses,K68+1,FALSE))*(K41+K61))*NumberOfWeeksInAYear,0),0)","v":0},null,null,null,null,{"$f":"(E69+G69+I69+K69)","v":0},"HEM Living Expense"]
[null,null,null,null,null,null,null,null,null,null,null,null,null,null,null,{"$f":"E55*NumberOfMonthsInAYear","v":0},"Customer Nominated Living Expenses"]
[null,null,null,null,null,null,null,null,null,null,null,null,null,null,null,{"$f":"MAX(P69,P70)","v":0},"Used Living Expenses"]
[null,null,null,null,null,null,null,null,null,null,null,null,null,null,null,{"$f":"K55*NumberOfMonthsInAYear","v":0},"Personal rent"]
[null,null,null,null,null,null,null,null,null,null,null,null,null,null,null,{"$f":"(K57*OtherMortgageRepaymentBuffer+K58+N56)*NumberOfMonthsInAYear","v":0},"Personal Debt"]
[]
[]
[]
[]
[null,null,"Results"]
[]
[]
[null,null,"Business income (EBITDA + net personal contribution)",null,{"$f":"E33+P52-P71-P72-P73","v":0},null,"Interest Expenses",null,{"$f":"(E8*I8)+(E18*G18)+(E19*G19)+(E20*G20)+(E21*G21)","v":0}]
[null,null,null,null,null,null,"Debt Repayments",null,{"$f":"((SUM(I18:I21)+MAX(I11:I12))*12)","v":0}]
[]
[]
[null,null,null,null,null,null,"Interest Coverage Ratio (ICR):",null,{"$f":"IFERROR(E81/I81,0)","v":0},null,{"$f":"IF(CRECheckForCompleteness=\"INCOMPLETE\",\"INCOMPLETE\",IF(E9=FullDoc,IF(I85>=MinimumICRFullDoc,\"PASS\",\"FAIL\"),IF(E9=AltDoc,IF(I85>=MinimumICRAltDoc,\"PASS\",\"FAIL\"),IF(E9=LeaseDoc,IF(I85>=MinimumICRLeaseDoc,\"PASS\",\"FAIL\")))))","v":"INCOMPLETE"}]
[null,null,null,null,null,null,"Debt Service Coverage Ratio (DSCR):",null,{"$f":"IFERROR(E81/I82,0)","v":0},null,{"$f":"IF(I89=\"INCOMPLETE\",\"INCOMPLETE\",IF(E9=FullDoc,IF(I86>=MinimumDSCRFullDoc,\"PASS\",\"FAIL\"),IF(E9=AltDoc,IF(I86>=MinimumDSCRAltDoc,\"PASS\",\"FAIL\"),IF(E9=LeaseDoc,IF(I86>=MinimumDSCRLeaseDoc,\"PASS\",\"FAIL\")))))","v":"INCOMPLETE"}]
[]
[null,null,null,null,null,null,null,null,"Application Status"]
[null,null,null,null,null,null,null,null,{"$f":"IF(OR(E8=\"\",I8=\"\",E9=\"\",I9=\"\",I9<I10),\"INCOMPLETE\",\"COMPLETE\")","v":"INCOMPLETE"}]

{"sheet":"CommercialBetterChoice","index":1,"n_rows":89,"n_cols":17,"rows_kept":89,"cut":false,"hidden":true,"merged":[[57,6,57,8],[87,8,87,10],[88,8,88,10],[3,4,3,8],[31,2,32,2],[53,6,53,8],[54,6,54,8],[55,6,55,8],[56,6,56,8]]}
[null,"Commercial Better Choice Servicability Calculator"]
[null,null,{"$f":"Residential!C3","v":"Version 5.8 (16 August 2021)"}]
[]
[null,null,"Applicant Name"]
[]
[null,null,"Proposed Loan Details"]
[]
[null,null,"New Loan Amount",null,null,null,"Interest Rate"]
[null,null,"Documentation Type",null,null,null,"Loan Term (Years)"]
[null,null,null,null,null,null,"I/O Term (Years)"]
[null,null,null,null,null,null,"P&I Repayment",null,{"$f":"IF(I9>I10,-PMT(I8/12,12*(I9-I10),E8),0)","v":0}]
[null,null,null,null,null,null,"IO Repayment",null,{"$f":"IF(I10>0,E8*I8/12,0)","v":0}]
[]
[]
[null,null,"Business Loan Details",null,null,null,null,null,null,null,null,null,null,"excluding proposed Pepper loan"]
[]
[null,null,null,null,"Loan Amount",null,"Rate",null,"Actual Loan Repayment (Monthly)"]
[null,null,"Loan 1"]
[null,null,"Loan 2"]
[null,null,"Loan 3"]
[null,null,"Loan 4"]
[]
[]
[null,null,"Business Income / Expenses"]
[]
[null,null,"Business Income",null,null,null,null,null,"Add Backs"]
[null,null,"Net Profit Before Tax",null,null,null,null,null,"Depreciation"]
[null,null,"Proposed Net CRE Rental Income",null,null,null,null,null,"Ammortisation"]
[null,null,"Proposed Gross Residential Rental Income",null,null,null,null,null,"Interest Paid"]
[null,null,null,null,null,null,null,null,"Directors Salaries/Fees/Super"]
[null,null,null,null,null,null,null,null,"Other"]
[null,null,"Earning Before Interest, Tax, Depreciation & Ammortisation (EBITDA)"]
[null,null,null,null,{"$f":"K33+E27+E28+(E29*RentalIncomeShading)","v":0},null,null,null," Total Add Backs",null,{"$f":"SUM(K27:K31)","v":0}]
[]
[]
[null,null,"Personal Income / Expenses"]
[]
[null,null,"Applicant Details",null,"Applicant 1",null,"Applicant 2",null,"Applicant 3",null,"Applicant 4"]
[null,null,"Status"]
[null,null,"Couple With"]
[null,null,"Dependants"]
[null,null,null,null,"Enter a Status",null,"Enter a Status",null,"Enter a Status",null,"Enter a Status"]
[]
[null,null,"Gross Annual Income"]
[null,null,"Untaxed Allowable Income"]
[null,null,"Gross Residential Rental Income (Other)"]
[null,null,"Total Income",null,{"$f":"E44+E45+E46*RentalIncomeShading","v":0},null,{"$f":"G44+G45+G46*RentalIncomeShading","v":0},null,{"$f":"I44+I45+I46*RentalIncomeShading","v":0},null,{"$f":"K44+K45+K46*RentalIncomeShading","v":0},null,null,null,null,{"$f":"(E47+G47+I47+K47)","v":0},"Total Gross Annual Income"]
[]
[null,null,"Investment Property Loan Balance (personal name)"]
[null,null,"Tax",null,{"$f":"VLOOKUP(E66,IncomeTaxTable,2,TRUE)+MAX(((E66-VLOOKUP(E66,IncomeTaxTable,1,TRUE))*VLOOKUP(E66,IncomeTaxTable,3,TRUE)),0) +IF(E66<=MinimumForPartialLevy,0,IF(E66>MinimumForFullLevy,E66*MedicareFullLevyPerc,(E66-MinimumForPartialLevy)*MedicarePartialLevyPerc))","v":0},null,{"$f":"VLOOKUP(G66,IncomeTaxTable,2,TRUE)+MAX(((G66-VLOOKUP(G66,IncomeTaxTable,1,TRUE))*VLOOKUP(G66,IncomeTaxTable,3,TRUE)),0) +IF(G66<=MinimumForPartialLevy,0,IF(G66>MinimumForFullLevy,G66*MedicareFullLevyPerc,(G66-MinimumForPartialLevy)*MedicarePartialLevyPerc))","v":0},null,{"$f":"VLOOKUP(I66,IncomeTaxTable,2,TRUE)+MAX(((I66-VLOOKUP(I66,IncomeTaxTable,1,TRUE))*VLOOKUP(I66,IncomeTaxTable,3,TRUE)),0) +IF(I66<=MinimumForPartialLevy,0,IF(I66>MinimumForFullLevy,I66*MedicareFullLevyPerc,(I66-MinimumForPartialLevy)*MedicarePartialLevyPerc))","v":0},null,{"$f":"VLOOKUP(K66,IncomeTaxTable,2,TRUE)+MAX(((K66-VLOOKUP(K66,IncomeTaxTable,1,TRUE))*VLOOKUP(K66,IncomeTaxTable,3,TRUE)),0) +IF(K66<=MinimumForPartialLevy,0,IF(K66>MinimumForFullLevy,K66*MedicareFullLevyPerc,(K66-MinimumForPartialLevy)*MedicarePartialLevyPerc))","v":0}]
[null,null,"Tax offset for Low Income Earners",null,{"$f":"0-(IF(E39=\"Company\",0,MIN(E50,IF(OR(E66<=0,E66>=TaxOffsetMaximumEntitlement),0,TaxOffsetForLowIncomeEarners-IF(E66>TaxOffsetIncomeThreshholds,((E66-TaxOffsetIncomeThreshholds)*TaxOffSetReducedByPerc),0))))+IF(OR(E39=\"Company\",E66=\"\",E66=0),0,IF(VLOOKUP(E66,TaxOffsetForLowIncomeTable,2,TRUE)+(E66-VLOOKUP(E66,TaxOffsetForLowIncomeTable,1,TRUE))*VLOOKUP(E66,TaxOffsetForLowIncomeTable,3,TRUE)<0,0,VLOOKUP(E66,TaxOffsetForLowIncomeTable,2,TRUE)+(E66-VLOOKUP(E66,TaxOffsetForLowIncomeTable,1,TRUE))*VLOOKUP(E66,TaxOffsetForLowIncomeTable,3,TRUE))))","v":0},null,{"$f":"0-(IF(G39=\"Company\",0,MIN(G50,IF(OR(G66<=0,G66>=TaxOffsetMaximumEntitlement),0,TaxOffsetForLowIncomeEarners-IF(G66>TaxOffsetIncomeThreshholds,((G66-TaxOffsetIncomeThreshholds)*TaxOffSetReducedByPerc),0))))+IF(OR(G39=\"Company\",G66=\"\",G66=0),0,IF(VLOOKUP(G66,TaxOffsetForLowIncomeTable,2,TRUE)+(G66-VLOOKUP(G66,TaxOffsetForLowIncomeTable,1,TRUE))*VLOOKUP(G66,TaxOffsetForLowIncomeTable,3,TRUE)<0,0,VLOOKUP(G66,TaxOffsetForLowIncomeTable,2,TRUE)+(G66-VLOOKUP(G66,TaxOffsetForLowIncomeTable,1,TRUE))*VLOOKUP(G66,TaxOffsetForLowIncomeTable,3,TRUE))))","v":0},null,{"$f":"0-(IF(I39=\"Company\",0,MIN(I50,IF(OR(I66<=0,I66>=TaxOffsetMaximumEntitlement),0,TaxOffsetForLowIncomeEarners-IF(I66>TaxOffsetIncomeThreshholds,((I66-TaxOffsetIncomeThreshholds)*TaxOffSetReducedByPerc),0))))+IF(OR(I39=\"Company\",I66=\"\",I66=0),0,IF(VLOOKUP(I66,TaxOffsetForLowIncomeTable,2,TRUE)+(I66-VLOOKUP(I66,TaxOffsetForLowIncomeTable,1,TRUE))*VLOOKUP(I66,TaxOffsetForLowIncomeTable,3,TRUE)<0,0,VLOOKUP(I66,TaxOffsetForLowIncomeTable,2,TRUE)+(I66-VLOOKUP(I66,TaxOffsetForLowIncomeTable,1,TRUE))*VLOOKUP(I66,TaxOffsetForLowIncomeTable,3,TRUE))))","v":0},null,{"$f":"0-(IF(K39=\"Company\",0,MIN(K50,IF(OR(K66<=0,K66>=TaxOffsetMaximumEntitlement),0,TaxOffsetForLowIncomeEarners-IF(K66>TaxOffsetIncomeThreshholds,((K66-TaxOffsetIncomeThreshholds)*TaxOffSetReducedByPerc),0))))+IF(OR(K39=\"Company\",K66=\"\",K66=0),0,IF(VLOOKUP(K66,TaxOffsetForLowIncomeTable,2,TRUE)+(K66-VLOOKUP(K66,TaxOffsetForLowIncomeTable,1,TRUE))*VLOOKUP(K66,TaxOffsetForLowIncomeTable,3,TRUE)<0,0,VLOOKUP(K66,TaxOffsetForLowIncomeTable,2,TRUE)+(K66-VLOOKUP(K66,TaxOffsetForLowIncomeTable,1,TRUE))*VLOOKUP(K66,TaxOffsetForLowIncomeTable,3,TRUE))))","v":0}]
[null,null,"Net Income",null,{"$f":"E47-(IF(E50+E51>0,E50+E51,0))","v":0},null,{"$f":"G47-(IF(G50+G51>0,G50+G51,0))","v":0},null,{"$f":"I47-(IF(I50+I51>0,I50+I51,0))","v":0},null,{"$f":"K47-(IF(K50+K51>0,K50+K51,0))","v":0},null,null,null,null,{"$f":"(E52+G52+I52+K52)","v":0},"Total Net Annual Income"]
[]
[null,null,"Living Expenses (monthly)",null,null,null,"Other Commitments",null,null,null,"Per Month"]
[null,null,"Declared Living Expenses",null,null,null,"Rent/Board"]
[null,null,null,null,null,null,"Total Credit Card Limit",null,null,null,null,null,"3%:",{"$f":"K56*CreditCardCommitments","v":0}]
[null,null,null,null,null,null,"Personal Mortgage Repayments"]
[null,null,null,null,null,null,"Other Consumer Debt"]
[]
[null,null,"Is an Applicant",null,{"$f":"OR(E39<>\"\")","v":false},null,{"$f":"OR(G39<>\"\")","v":false},null,{"$f":"OR(I39<>\"\")","v":false},null,{"$f":"OR(K39<>\"\")","v":false}]
[null,null,"Spouse Dependants",null,{"$f":"IFERROR(HLOOKUP(E40,CREApplicantDetailsTableBetterChoice,4,FALSE),0)","v":0},null,{"$f":"IFERROR(HLOOKUP(G40,CREApplicantDetailsTableBetterChoice,4,FALSE),0)","v":0},null,{"$f":"IFERROR(HLOOKUP(I40,CREApplicantDetailsTableBetterChoice,4,FALSE),0)","v":0},null,{"$f":"IFERROR(HLOOKUP(K40,CREApplicantDetailsTableBetterChoice,4,FALSE),0)","v":0}]
[null,null,"Pepper Status Code",null,{"$f":"IF(E$39=\"Individual (Couple)\",\"P-C\",IF(E$39=\"Individual (Single)\",\"P-S\",\"\"))","v":""},null,{"$f":"IF(G$39=\"Individual (Couple)\",\"P-C\",IF(G$39=\"Individual (Single)\",\"P-S\",\"\"))","v":""},null,{"$f":"IF(I$39=\"Individual (Couple)\",\"P-C\",IF(I$39=\"Individual (Single)\",\"P-S\",\"\"))","v":""},null,{"$f":"IF(K$39=\"Individual (Couple)\",\"P-C\",IF(K$39=\"Individual (Single)\",\"P-S\",\"\"))","v":""}]
[null,null,"Pepper Dependents Code",null,{"$f":"IF(E$39=\"Individual (Couple)\",\"P-CD\"&INDEX(Validation!$B$21:$B$26,MATCH((E$41+E$61),Validation!$A$21:$A$26,1)),IF(E$39=\"Individual (Single)\",\"P-SD\"&INDEX(Validation!$B$21:$B$26,MATCH((E$41+E$61),Validation!$A$21:$A$26,1)),\"\"))","v":""},null,{"$f":"IF(G$39=\"Individual (Couple)\",\"P-CD\"&INDEX(Validation!$B$21:$B$26,MATCH((G$41+G$61),Validation!$A$21:$A$26,1)),IF(G$39=\"Individual (Single)\",\"P-SD\"&INDEX(Validation!$B$21:$B$26,MATCH((G$41+G$61),Validation!$A$21:$A$26,1)),\"\"))","v":""},null,{"$f":"IF(I$39=\"Individual (Couple)\",\"P-CD\"&INDEX(Validation!$B$21:$B$26,MATCH((I$41+I$61),Validation!$A$21:$A$26,1)),IF(I$39=\"Individual (Single)\",\"P-SD\"&INDEX(Validation!$B$21:$B$26,MATCH((I$41+I$61),Validation!$A$21:$A$26,1)),\"\"))","v":""},null,{"$f":"IF(K$39=\"Individual (Couple)\",\"P-CD\"&INDEX(Validation!$B$21:$B$26,MATCH((K$41+K$61),Validation!$A$21:$A$26,1)),IF(K$39=\"Individual (Single)\",\"P-SD\"&INDEX(Validation!$B$21:$B$26,MATCH((K$41+K$61),Validation!$A$21:$A$26,1)),\"\"))","v":""}]
[null,null,"Exclude for LE calc",null,{"$f":"IFERROR(IF(MATCH(E40,$E$38:$K$38,0)<(COLUMN()-COLUMN($E$38:$K$38)+1),TRUE,FALSE),FALSE)","v":false},null,{"$f":"IFERROR(IF(MATCH(G40,$E$38:$K$38,0)<(COLUMN()-COLUMN($E$38:$K$38)+1),TRUE,FALSE),FALSE)","v":false},null,{"$f":"IFERROR(IF(MATCH(I40,$E$38:$K$38,0)<(COLUMN()-COLUMN($E$38:$K$38)+1),TRUE,FALSE),FALSE)","v":false},null,{"$f":"IFERROR(IF(MATCH(K40,$E$38:$K$38,0)<(COLUMN()-COLUMN($E$38:$K$38)+1),TRUE,FALSE),FALSE)","v":false}]
[]
[null,null,"Total Taxable Income",null,{"$f":"MAX(E44+E46*RentalIncomeShading-E49*WorkingsForNegativeGearing,0)","v":0},null,{"$f":"MAX(G44+G46*RentalIncomeShading-G49*WorkingsForNegativeGearing,0)","v":0},null,0,null,0,null,null,null,null,{"$f":"(E66+G66+I66+K66)","v":0},"Total Taxable Income"]
[null,null,"Spouse Income",null,{"$f":"IFERROR(HLOOKUP(E40,CREApplicantDetailsTableBetterChoice,7,FALSE),0)","v":0},null,{"$f":"IFERROR(HLOOKUP(G40,CREApplicantDetailsTableBetterChoice,7,FALSE),0)","v":0},null,{"$f":"IFERROR(HLOOKUP(I40,CREApplicantDetailsTableBetterChoice,7,FALSE),0)","v":0},null,{"$f":"IFERROR(HLOOKUP(K40,CREApplicantDetailsTableBetterChoice,7,FALSE),0)","v":0}]
[null,null,"Income Bracket",null,{"$f":"IFERROR(HLOOKUP(E44+E67,HemCombinedIncomeRange,3,TRUE),1)","v":1},null,{"$f":"IFERROR(HLOOKUP(G44+G67,HemCombinedIncomeRange,3,TRUE),1)","v":1},null,{"$f":"IFERROR(HLOOKUP(I44+I67,HemCombinedIncomeRange,3,TRUE),1)","v":1},null,{"$f":"IFERROR(HLOOKUP(K44+K67,HemCombinedIncomeRange,3,TRUE),1)","v":1}]
[null,null,"HEM Living Expense",null,{"$f":"IFERROR(IF(AND(E60,NOT(E64)),(VLOOKUP(E62,HemTableForExpenses,E68+1,FALSE) +(VLOOKUP(E63,HemTableForExpenses,E68+1,FALSE))*(E41+E61))*NumberOfWeeksInAYear,0),0)","v":0},null,{"$f":"IFERROR(IF(AND(G60,NOT(G64)),(VLOOKUP(G62,HemTableForExpenses,G68+1,FALSE) +(VLOOKUP(G63,HemTableForExpenses,G68+1,FALSE))*(G41+G61))*NumberOfWeeksInAYear,0),0)","v":0},null,{"$f":"IFERROR(IF(AND(I60,NOT(I64)),(VLOOKUP(I62,HemTableForExpenses,I68+1,FALSE) +(VLOOKUP(I63,HemTableForExpenses,I68+1,FALSE))*(I41+I61))*NumberOfWeeksInAYear,0),0)","v":0},null,{"$f":"IFERROR(IF(AND(K60,NOT(K64)),(VLOOKUP(K62,HemTableForExpenses,K68+1,FALSE) +(VLOOKUP(K63,HemTableForExpenses,K68+1,FALSE))*(K41+K61))*NumberOfWeeksInAYear,0),0)","v":0},null,null,null,null,{"$f":"(E69+G69+I69+K69)","v":0},"HEM Living Expense"]
[null,null,null,null,null,null,null,null,null,null,null,null,null,null,null,{"$f":"E55*NumberOfMonthsInAYear","v":0},"Customer Nominated Living Expenses"]
[null,null,null,null,null,null,null,null,null,null,null,null,null,null,null,{"$f":"MAX(P69,P70)","v":0},"Used Living Expenses"]
[null,null,null,null,null,null,null,null,null,null,null,null,null,null,null,{"$f":"K55*NumberOfMonthsInAYear","v":0},"Personal rent"]
[null,null,null,null,null,null,null,null,null,null,null,null,null,null,null,{"$f":"(K57*OtherMortgageRepaymentBuffer+K58+N56)*NumberOfMonthsInAYear","v":0},"Personal Debt"]
[]
[]
[]
[]
[null,null,"Results"]
[]
[]
[null,null,"Business income (EBITDA + net personal contribution)",null,{"$f":"E33+P52-P71-P72-P73","v":0},null,"Interest Expenses",null,{"$f":"(E8*I8)+(E18*G18)+(E19*G19)+(E20*G20)+(E21*G21)","v":0}]
[null,null,null,null,null,null,"Debt Repayments",null,{"$f":"((SUM(I18:I21)+MAX(I11:I12))*12)","v":0}]
[]
[]
[null,null,null,null,null,null,"Interest Coverage Ratio (ICR):",null,{"$f":"IFERROR(E81/I81,0)","v":0},null,{"$f":"IF(CRECheckForCompletenessBetterChoice=\"INCOMPLETE\",\"INCOMPLETE\",IF(E9=FullDoc,IF(I85>=MinimumICRFullDoc,\"PASS\",\"FAIL\"),IF(E9=AltDoc,IF(I85>=MinimumICRAltDoc,\"PASS\",\"FAIL\"),IF(E9=LeaseDoc,IF(I85>=MinimumICRLeaseDoc,\"PASS\",\"FAIL\")))))","v":"INCOMPLETE"}]
[null,null,null,null,null,null,"Debt Service Coverage Ratio (DSCR):",null,{"$f":"IFERROR(E81/I82,0)","v":0},null,{"$f":"IF(I89=\"INCOMPLETE\",\"INCOMPLETE\",IF(E9=FullDoc,IF(I86>=MinimumDSCRFullDocBetterChoice,\"PASS\",IF(I86>=MinimumDSCRFullDocWithMessageBetterChoice,MinimumDSCRConditionMessageBetterChoice,\"FAIL\")),IF(E9=AltDoc,IF(I86>=MinimumDSCRAltDocBetterChoice,\"PASS\",IF(I86>=MinimumDSCRAltDocWithMessageBetterChoice,MinimumDSCRConditionMessageBetterChoice,\"FAIL\")),IF(E9=LeaseDoc,IF(I86>=MinimumDSCRLeaseDocBetterChoice,\"PASS\",IF(I86>=MinimumDSCRLeaseDocWithMessageBetterChoice,MinimumDSCRConditionMessageBetterChoice,\"FAIL\"))))))","v":"INCOMPLETE"}]
[]
[null,null,null,null,null,null,null,null,"Application Status"]
[null,null,null,null,null,null,null,null,{"$f":"IF(OR(E8=\"\",I8=\"\",E9=\"\",I9=\"\",I9<I10),\"INCOMPLETE\",\"COMPLETE\")","v":"INCOMPLETE"}]

{"sheet":"Residential","index":2,"n_rows":89,"n_cols":18,"rows_kept":89,"cut":false,"hidden":false,"merged":[[57,10,60,14],[84,2,84,15],[88,2,88,15],[41,12,41,14],[42,12,42,14],[74,6,75,6],[59,2,59,4],[60,2,60,4],[74,14,75,14],[81,12,82,14],[81,6,82,10],[83,6,83,10],[83,12,83,14],[66,8,66,10],[61,2,61,4],[54,2,54,4],[5,4,5,8],[49,8,49,10],[50,8,50,10],[51,8,51,10],[52,8,52,10],[48,2,48,4],[40,10,40,14],[48,8,48,10],[50,2,50,4],[51,2,51,4],[52,2,52,4],[12,10,12,15],[55,2,55,4],[56,2,56,4],[57,2,57,4],[58,2,58,4],[49,2,49,4],[53,2,53,4]]}
[]
[null,null,"Serviceability Calculator"]
[null,null,"Version 5.8 (16 August 2021)"]
[]
[]
[null,null,"Applicant Name"]
[]
[null,null,"Loan Details"]
[null,null,"(including capitalised fees)",null,null,null,"WAVG Assessment Rate",null,{"$f":"MAX(BaselineAssessmentRate,ResiWAVGInterestRate+AssessmentLoading)","v":5.5E-2}]
[null,null,"New Loan Amount",null,null,null,"Interest Rate",5,null,null,"Loan Term",null,null,null,"IO Term"]
[null,null,"New Loan Amount"]
[null,null,"Total Loan Amount",null,{"$f":"SUM(E10:E11)","v":0},null,"WAVG Interest Rate",null,{"$f":"IF(ResiNewLoanTotalAmount=0,0,((ResiNewLoanAmount1*ResiInterestRate1)+(ResiNewLoanAmount2*ResiInterestRate2))/ResiNewLoanTotalAmount)","v":0},null,"WAVG Loan Term",null,{"$f":"IF(ResiNewLoanTotalAmount=0,0,((ResiNewLoanAmount1*ResiLoanTerm1)+(ResiNewLoanAmount2*ResiLoanTerm2))/ResiNewLoanTotalAmount)","v":0},null,"WAVG IO Term",{"$f":"IF(ResiNewLoanTotalAmount=0,0,((ResiNewLoanAmount1*ResiLoanIOTerm1)+(ResiNewLoanAmount2*ResiLoanIOTerm2))/ResiNewLoanTotalAmount)","v":0}]
[null,null,null,null,null,null,null,null,null,null,{"$f":"IF(ResiWAVGLoanTerm>MaximumLoanTermInYearsForPrimeLoans, \"Loans Terms > \" & MaximumLoanTermInYearsForPrimeLoans & \" years not available on Prime\", \" \")","v":" "}]
[null,null,"Applicant Details:",null,"Applicant 1",null,"Applicant 2",null,"Applicant 3",null,"Applicant 4",null,"Applicant 5",null,"Applicant 6",null,null,"Total"]
[null,null,"Status"]
[null,null,"Individual (Couple) With","Applicant 1"]
[null,null,"Dependants"]
[null,null,null,null,{"$f":"IF(AND(SUM(E19:E23,E25:E26)<>0,E15=\"\"),\"Enter a Status\",\"\")","v":""},null,{"$f":"IF(AND(SUM(G19:G23,G25:G26)<>0,G15=\"\"),\"Enter a Status\",\"\")","v":""},null,{"$f":"IF(AND(SUM(I19:I23,I25:I26)<>0,I15=\"\"),\"Enter a Status\",\"\")","v":""},null,{"$f":"IF(AND(SUM(K19:K23,K25:K26)<>0,K15=\"\"),\"Enter a Status\",\"\")","v":""},null,{"$f":"IF(AND(SUM(M19:M23,M25:M26)<>0,M15=\"\"),\"Enter a Status\",\"\")","v":""},null,{"$f":"IF(AND(SUM(O19:O23,O25:O26)<>0,O15=\"\"),\"Enter a Status\",\"\")","v":""}]
[null,null,"Gross Annual Income"]
[" ",null,"Untaxed Allowable Income",null,null,null,null,null,null,null,null,null,null,null,null,null,null,{"$f":"(E20+G20+I20+K20+M20+O20)","v":0}]
[null,null,"Self Employed Income"]
[null,null,"Addbacks"]
[null,null,"Business NPBT"]
[]
[null,null,"Gross Rental Income"]
[null,null,"Investment Property Loan Balance"]
[null,null,"Total Income",null,{"$f":"E25*RentalIncomeShading+E19+E20+E21+E22+E23","v":0},null,{"$f":"G25*RentalIncomeShading+G19+G20+G21+G22+G23","v":0},null,{"$f":"I25*RentalIncomeShading+I19+I20+I21+I22+I23","v":0},null,{"$f":"K25*RentalIncomeShading+K19+K20+K21+K22+K23","v":0},null,{"$f":"M25*RentalIncomeShading+M19+M20+M21+M22+M23","v":0},null,{"$f":"O25*RentalIncomeShading+O19+O20+O21+O22+O23","v":0},null,null,{"$f":"(E27+G27+I27+K27+M27+O27)","v":0}]
[null,null,"Is an Applicant",null,{"$f":"AND(E15<>\"\")","v":false},null,{"$f":"AND(G15<>\"\")","v":false},null,{"$f":"AND(I15<>\"\")","v":false},null,{"$f":"AND(K15<>\"\")","v":false},null,{"$f":"AND(M15<>\"\")","v":false},null,{"$f":"AND(O15<>\"\")","v":false}]
[null,null,"Spouse Dependants",null,{"$f":"IFERROR(HLOOKUP(E16,ResiApplicantDetailsTable,4,FALSE),0)","v":0},null,{"$f":"IFERROR(HLOOKUP(G16,ResiApplicantDetailsTable,4,FALSE),0)","v":0},null,{"$f":"IFERROR(HLOOKUP(I16,ResiApplicantDetailsTable,4,FALSE),0)","v":0},null,{"$f":"IFERROR(HLOOKUP(K16,ResiApplicantDetailsTable,4,FALSE),0)","v":0},null,{"$f":"IFERROR(HLOOKUP(M16,ResiApplicantDetailsTable,4,FALSE),0)","v":0},null,{"$f":"IFERROR(HLOOKUP(O16,ResiApplicantDetailsTable,4,FALSE),0)","v":0}]
[null,null,"Pepper Status Code","Applicant 1",{"$f":"IF(E$15=\"Individual (Couple)\",\"P-C\",IF(E$15=\"Individual (Single)\",\"P-S\",\"\"))","v":""},null,{"$f":"IF(G$15=\"Individual (Couple)\",\"P-C\",IF(G$15=\"Individual (Single)\",\"P-S\",\"\"))","v":""},null,{"$f":"IF(I$15=\"Individual (Couple)\",\"P-C\",IF(I$15=\"Individual (Single)\",\"P-S\",\"\"))","v":""},null,{"$f":"IF(K$15=\"Individual (Couple)\",\"P-C\",IF(K$15=\"Individual (Single)\",\"P-S\",\"\"))","v":""},null,{"$f":"IF(M$15=\"Individual (Couple)\",\"P-C\",IF(M$15=\"Individual (Single)\",\"P-S\",\"\"))","v":""},null,{"$f":"IF(O$15=\"Individual (Couple)\",\"P-C\",IF(O$15=\"Individual (Single)\",\"P-S\",\"\"))","v":""}]
[null,null,"Pepper Dependents Code",null,{"$f":"IF(E$15=\"Individual (Couple)\",\"P-CD\"&INDEX(Validation!$B$21:$B$26,MATCH((E$17+E$29),Validation!$A$21:$A$26,1)),IF(E$15=\"Individual (Single)\",\"P-SD\"&INDEX(Validation!$B$21:$B$26,MATCH((E$17+E$29),Validation!$A$21:$A$26,1)),\"\"))","v":""},null,{"$f":"IF(G$15=\"Individual (Couple)\",\"P-CD\"&INDEX(Validation!$B$21:$B$26,MATCH((G$17+G$29),Validation!$A$21:$A$26,1)),IF(G$15=\"Individual (Single)\",\"P-SD\"&INDEX(Validation!$B$21:$B$26,MATCH((G$17+G$29),Validation!$A$21:$A$26,1)),\"\"))","v":""},null,{"$f":"IF(I$15=\"Individual (Couple)\",\"P-CD\"&INDEX(Validation!$B$21:$B$26,MATCH((I$17+I$29),Validation!$A$21:$A$26,1)),IF(I$15=\"Individual (Single)\",\"P-SD\"&INDEX(Validation!$B$21:$B$26,MATCH((I$17+I$29),Validation!$A$21:$A$26,1)),\"\"))","v":""},null,{"$f":"IF(K$15=\"Individual (Couple)\",\"P-CD\"&INDEX(Validation!$B$21:$B$26,MATCH((K$17+K$29),Validation!$A$21:$A$26,1)),IF(K$15=\"Individual (Single)\",\"P-SD\"&INDEX(Validation!$B$21:$B$26,MATCH((K$17+K$29),Validation!$A$21:$A$26,1)),\"\"))","v":""},null,{"$f":"IF(M$15=\"Individual (Couple)\",\"P-CD\"&INDEX(Validation!$B$21:$B$26,MATCH((M$17+M$29),Validation!$A$21:$A$26,1)),IF(M$15=\"Individual (Single)\",\"P-SD\"&INDEX(Validation!$B$21:$B$26,MATCH((M$17+M$29),Validation!$A$21:$A$26,1)),\"\"))","v":""},null,{"$f":"IF(O$15=\"Individual (Couple)\",\"P-CD\"&INDEX(Validation!$B$21:$B$26,MATCH((O$17+O$29),Validation!$A$21:$A$26,1)),IF(O$15=\"Individual (Single)\",\"P-SD\"&INDEX(Validation!$B$21:$B$26,MATCH((O$17+O$29),Validation!$A$21:$A$26,1)),\"\"))","v":""}]
[null,null,"Exclude for LE calc",null,{"$f":"IFERROR(IF(MATCH(E16,$E$14:$O$14,0)<(COLUMN()-COLUMN($E$14:$O$14)+1),TRUE,FALSE),FALSE)","v":false},null,{"$f":"IFERROR(IF(MATCH(G16,$E$14:$O$14,0)<(COLUMN()-COLUMN($E$14:$O$14)+1),TRUE,FALSE),FALSE)","v":false},null,{"$f":"IFERROR(IF(MATCH(I16,$E$14:$O$14,0)<(COLUMN()-COLUMN($E$14:$O$14)+1),TRUE,FALSE),FALSE)","v":false},null,{"$f":"IFERROR(IF(MATCH(K16,$E$14:$O$14,0)<(COLUMN()-COLUMN($E$14:$O$14)+1),TRUE,FALSE),FALSE)","v":false},null,{"$f":"IFERROR(IF(MATCH(M16,$E$14:$O$14,0)<(COLUMN()-COLUMN($E$14:$O$14)+1),TRUE,FALSE),FALSE)","v":false},null,{"$f":"IFERROR(IF(MATCH(O16,$E$14:$O$14,0)<(COLUMN()-COLUMN($E$14:$O$14)+1),TRUE,FALSE),FALSE)","v":false}]
[null,null,"Workings for Negative Gearing",null,{"$f":"IF(E26>0,E26*WorkingsForNegativeGearing+($G$51*12*(E26/SUM($E$26,$G$26,$I$26,$K$26,$M$26,$O$26))),0)","v":0},null,{"$f":"IF(G26>0,G26*WorkingsForNegativeGearing+($G$51*12*(G26/SUM($E$26,$G$26,$I$26,$K$26,$M$26,$O$26))),0)","v":0},null,{"$f":"IF(I26>0,I26*WorkingsForNegativeGearing+($G$51*12*(I26/SUM($E$26,$G$26,$I$26,$K$26,$M$26,$O$26))),0)","v":0},null,{"$f":"IF(K26>0,K26*WorkingsForNegativeGearing+($G$51*12*(K26/SUM($E$26,$G$26,$I$26,$K$26,$M$26,$O$26))),0)","v":0},null,{"$f":"IF(M26>0,M26*WorkingsForNegativeGearing+($G$51*12*(M26/SUM($E$26,$G$26,$I$26,$K$26,$M$26,$O$26))),0)","v":0},null,{"$f":"IF(O26>0,O26*WorkingsForNegativeGearing+($G$51*12*(O26/SUM($E$26,$G$26,$I$26,$K$26,$M$26,$O$26))),0)","v":0}]
[null,null,"Total Taxable Income Exc Business NPBT",null,{"$f":"MAX(0,E19+E25*RentalIncomeShading-E33+E21)","v":0},null,{"$f":"MAX(0,G19+G25*RentalIncomeShading-G33+G21)","v":0},null,{"$f":"MAX(0,I19+I25*RentalIncomeShading-I33+I21)","v":0},null,{"$f":"MAX(0,K19+K25*RentalIncomeShading-K33+K21)","v":0},null,{"$f":"MAX(0,M19+M25*RentalIncomeShading-M33+M21)","v":0},null,{"$f":"MAX(0,O19+O25*RentalIncomeShading-O33+O21)","v":0},null,null,{"$f":"(E34+G34+I34+K34+M34+O34)","v":0}]
[null,null,"Spouse Income",null,{"$f":"IFERROR(HLOOKUP(E16,$E$14:$O$27,ROWS($E$14:$O$27),FALSE),0)-IFERROR(HLOOKUP(E16,$E$14:$O$33,ROWS($E$14:$O$33),FALSE),0)","v":0},null,{"$f":"IFERROR(HLOOKUP(G16,$E$14:$O$27,ROWS($E$14:$O$27),FALSE),0)-IFERROR(HLOOKUP(G16,$E$14:$O$33,ROWS($E$14:$O$33),FALSE),0)","v":0},null,{"$f":"IFERROR(HLOOKUP(I16,$E$14:$O$27,ROWS($E$14:$O$27),FALSE),0)-IFERROR(HLOOKUP(I16,$E$14:$O$33,ROWS($E$14:$O$33),FALSE),0)","v":0},null,{"$f":"IFERROR(HLOOKUP(K16,$E$14:$O$27,ROWS($E$14:$O$27),FALSE),0)-IFERROR(HLOOKUP(K16,$E$14:$O$33,ROWS($E$14:$O$33),FALSE),0)","v":0},null,{"$f":"IFERROR(HLOOKUP(M16,$E$14:$O$27,ROWS($E$14:$O$27),FALSE),0)-IFERROR(HLOOKUP(M16,$E$14:$O$33,ROWS($E$14:$O$33),FALSE),0)","v":0},null,{"$f":"IFERROR(HLOOKUP(O16,$E$14:$O$27,ROWS($E$14:$O$27),FALSE),0)-IFERROR(HLOOKUP(O16,$E$14:$O$33,ROWS($E$14:$O$33),FALSE),0)","v":0}]
[null,null,"Income Bracket",null,{"$f":" IFERROR(HLOOKUP(E27+E35-E33,HemCombinedIncomeRange,3,TRUE),1)","v":1},null,{"$f":" IFERROR(HLOOKUP(G27+G35-G33,HemCombinedIncomeRange,3,TRUE),1)","v":1},null,{"$f":" IFERROR(HLOOKUP(I27+I35-I33,HemCombinedIncomeRange,3,TRUE),1)","v":1},null,{"$f":" IFERROR(HLOOKUP(K27+K35-K33,HemCombinedIncomeRange,3,TRUE),1)","v":1},null,{"$f":" IFERROR(HLOOKUP(M27+M35-M33,HemCombinedIncomeRange,3,TRUE),1)","v":1},null,{"$f":" IFERROR(HLOOKUP(O27+O35-O33,HemCombinedIncomeRange,3,TRUE),1)","v":1}]
[null,null,"Tax",null,{"$f":"IF(E15=\"Company\",E34*CompanyTax,INDEX(TaxForBracket,MATCH(E34,TaxBracketMin,1))+INDEX(TaxRate,MATCH(E34,TaxBracketMin,1))*(E34-INDEX(TaxBracketMin,MATCH(E34,TaxBracketMin,1)))+IF(E34<='Tax Table'!$B$6,0,IF(E34<='Tax Table'!$B$7,(E34-'Tax Table'!$B$6)*'Tax Table'!$C$6,E34*'Tax Table'!$C$7)))+(E23*CompanyTax)","v":0},null,{"$f":"IF(G15=\"Company\",G34*CompanyTax,INDEX(TaxForBracket,MATCH(G34,TaxBracketMin,1))+INDEX(TaxRate,MATCH(G34,TaxBracketMin,1))*(G34-INDEX(TaxBracketMin,MATCH(G34,TaxBracketMin,1)))+IF(G34<='Tax Table'!$B$6,0,IF(G34<='Tax Table'!$B$7,(G34-'Tax Table'!$B$6)*'Tax Table'!$C$6,G34*'Tax Table'!$C$7)))+(G23*CompanyTax)","v":0},null,{"$f":"IF(I15=\"Company\",I34*CompanyTax,INDEX(TaxForBracket,MATCH(I34,TaxBracketMin,1))+INDEX(TaxRate,MATCH(I34,TaxBracketMin,1))*(I34-INDEX(TaxBracketMin,MATCH(I34,TaxBracketMin,1)))+IF(I34<='Tax Table'!$B$6,0,IF(I34<='Tax Table'!$B$7,(I34-'Tax Table'!$B$6)*'Tax Table'!$C$6,I34*'Tax Table'!$C$7)))+(I23*CompanyTax)","v":0},null,{"$f":"IF(K15=\"Company\",K34*CompanyTax,INDEX(TaxForBracket,MATCH(K34,TaxBracketMin,1))+INDEX(TaxRate,MATCH(K34,TaxBracketMin,1))*(K34-INDEX(TaxBracketMin,MATCH(K34,TaxBracketMin,1)))+IF(K34<='Tax Table'!$B$6,0,IF(K34<='Tax Table'!$B$7,(K34-'Tax Table'!$B$6)*'Tax Table'!$C$6,K34*'Tax Table'!$C$7)))+(K23*CompanyTax)","v":0},null,{"$f":"IF(M15=\"Company\",M34*CompanyTax,INDEX(TaxForBracket,MATCH(M34,TaxBracketMin,1))+INDEX(TaxRate,MATCH(M34,TaxBracketMin,1))*(M34-INDEX(TaxBracketMin,MATCH(M34,TaxBracketMin,1)))+IF(M34<='Tax Table'!$B$6,0,IF(M34<='Tax Table'!$B$7,(M34-'Tax Table'!$B$6)*'Tax Table'!$C$6,M34*'Tax Table'!$C$7)))+(M23*CompanyTax)","v":0},null,{"$f":"IF(O15=\"Company\",O34*CompanyTax,INDEX(TaxForBracket,MATCH(O34,TaxBracketMin,1))+INDEX(TaxRate,MATCH(O34,TaxBracketMin,1))*(O34-INDEX(TaxBracketMin,MATCH(O34,TaxBracketMin,1)))+IF(O34<='Tax Table'!$B$6,0,IF(O34<='Tax Table'!$B$7,(O34-'Tax Table'!$B$6)*'Tax Table'!$C$6,O34*'Tax Table'!$C$7)))+(O23*CompanyTax)","v":0}]
[null,null,"Tax offset for Low Income Earners",null,{"$f":"0-(IF(E15=\"Company\",0,MIN(E37,IF(OR(E34<=0,E34>=TaxOffsetMaximumEntitlement),0,TaxOffsetForLowIncomeEarners-IF(E34>TaxOffsetIncomeThreshholds,((E34-TaxOffsetIncomeThreshholds)*TaxOffSetReducedByPerc),0))))+IF(OR(E15=\"Company\",E34=\"\",E34=0),0,IF(VLOOKUP(E34,TaxOffsetForLowIncomeTable,2,TRUE)+(E34-VLOOKUP(E34,TaxOffsetForLowIncomeTable,1,TRUE))*VLOOKUP(E34,TaxOffsetForLowIncomeTable,3,TRUE)<0,0,VLOOKUP(E34,TaxOffsetForLowIncomeTable,2,TRUE)+(E34-VLOOKUP(E34,TaxOffsetForLowIncomeTable,1,TRUE))*VLOOKUP(E34,TaxOffsetForLowIncomeTable,3,TRUE))))","v":0},null,{"$f":"0-(IF(G15=\"Company\",0,MIN(G37,IF(OR(G34<=0,G34>=TaxOffsetMaximumEntitlement),0,TaxOffsetForLowIncomeEarners-IF(G34>TaxOffsetIncomeThreshholds,((G34-TaxOffsetIncomeThreshholds)*TaxOffSetReducedByPerc),0))))+IF(OR(G15=\"Company\",G34=\"\",G34=0),0,IF(VLOOKUP(G34,TaxOffsetForLowIncomeTable,2,TRUE)+(G34-VLOOKUP(G34,TaxOffsetForLowIncomeTable,1,TRUE))*VLOOKUP(G34,TaxOffsetForLowIncomeTable,3,TRUE)<0,0,VLOOKUP(G34,TaxOffsetForLowIncomeTable,2,TRUE)+(G34-VLOOKUP(G34,TaxOffsetForLowIncomeTable,1,TRUE))*VLOOKUP(G34,TaxOffsetForLowIncomeTable,3,TRUE))))","v":0},null,{"$f":"0-(IF(I15=\"Company\",0,MIN(I37,IF(OR(I34<=0,I34>=TaxOffsetMaximumEntitlement),0,TaxOffsetForLowIncomeEarners-IF(I34>TaxOffsetIncomeThreshholds,((I34-TaxOffsetIncomeThreshholds)*TaxOffSetReducedByPerc),0))))+IF(OR(I15=\"Company\",I34=\"\",I34=0),0,IF(VLOOKUP(I34,TaxOffsetForLowIncomeTable,2,TRUE)+(I34-VLOOKUP(I34,TaxOffsetForLowIncomeTable,1,TRUE))*VLOOKUP(I34,TaxOffsetForLowIncomeTable,3,TRUE)<0,0,VLOOKUP(I34,TaxOffsetForLowIncomeTable,2,TRUE)+(I34-VLOOKUP(I34,TaxOffsetForLowIncomeTable,1,TRUE))*VLOOKUP(I34,TaxOffsetForLowIncomeTable,3,TRUE))))","v":0},null,{"$f":"0-(IF(K15=\"Company\",0,MIN(K37,IF(OR(K34<=0,K34>=TaxOffsetMaximumEntitlement),0,TaxOffsetForLowIncomeEarners-IF(K34>TaxOffsetIncomeThreshholds,((K34-TaxOffsetIncomeThreshholds)*TaxOffSetReducedByPerc),0))))+IF(OR(K15=\"Company\",K34=\"\",K34=0),0,IF(VLOOKUP(K34,TaxOffsetForLowIncomeTable,2,TRUE)+(K34-VLOOKUP(K34,TaxOffsetForLowIncomeTable,1,TRUE))*VLOOKUP(K34,TaxOffsetForLowIncomeTable,3,TRUE)<0,0,VLOOKUP(K34,TaxOffsetForLowIncomeTable,2,TRUE)+(K34-VLOOKUP(K34,TaxOffsetForLowIncomeTable,1,TRUE))*VLOOKUP(K34,TaxOffsetForLowIncomeTable,3,TRUE))))","v":0},null,{"$f":"0-(IF(M15=\"Company\",0,MIN(M37,IF(OR(M34<=0,M34>=TaxOffsetMaximumEntitlement),0,TaxOffsetForLowIncomeEarners-IF(M34>TaxOffsetIncomeThreshholds,((M34-TaxOffsetIncomeThreshholds)*TaxOffSetReducedByPerc),0))))+IF(OR(M15=\"Company\",M34=\"\",M34=0),0,IF(VLOOKUP(M34,TaxOffsetForLowIncomeTable,2,TRUE)+(M34-VLOOKUP(M34,TaxOffsetForLowIncomeTable,1,TRUE))*VLOOKUP(M34,TaxOffsetForLowIncomeTable,3,TRUE)<0,0,VLOOKUP(M34,TaxOffsetForLowIncomeTable,2,TRUE)+(M34-VLOOKUP(M34,TaxOffsetForLowIncomeTable,1,TRUE))*VLOOKUP(M34,TaxOffsetForLowIncomeTable,3,TRUE))))","v":0},null,{"$f":"0-(IF(O15=\"Company\",0,MIN(O37,IF(OR(O34<=0,O34>=TaxOffsetMaximumEntitlement),0,TaxOffsetForLowIncomeEarners-IF(O34>TaxOffsetIncomeThreshholds,((O34-TaxOffsetIncomeThreshholds)*TaxOffSetReducedByPerc),0))))+IF(OR(O15=\"Company\",O34=\"\",O34=0),0,IF(VLOOKUP(O34,TaxOffsetForLowIncomeTable,2,TRUE)+(O34-VLOOKUP(O34,TaxOffsetForLowIncomeTable,1,TRUE))*VLOOKUP(O34,TaxOffsetForLowIncomeTable,3,TRUE)<0,0,VLOOKUP(O34,TaxOffsetForLowIncomeTable,2,TRUE)+(O34-VLOOKUP(O34,TaxOffsetForLowIncomeTable,1,TRUE))*VLOOKUP(O34,TaxOffsetForLowIncomeTable,3,TRUE))))","v":0}]
[null,null,"Net",null,{"$f":"E27-(IF(E37+E38>0,E37+E38,0))","v":0},null,{"$f":"G27-(IF(G37+G38>0,G37+G38,0))","v":0},null,{"$f":"I27-(IF(I37+I38>0,I37+I38,0))","v":0},null,{"$f":"K27-(IF(K37+K38>0,K37+K38,0))","v":0},null,{"$f":"M27-(IF(M37+M38>0,M37+M38,0))","v":0},null,{"$f":"O27-(IF(O37+O38>0,O37+O38,0))","v":0},null,null,{"$f":"(E39+G39+I39+K39+M39+O39)","v":0}]
[null,null,"HEM Living Expense",null,{"$f":"IFERROR(IF(AND(E28,NOT(E32)),(VLOOKUP(E30,HemTableForExpenses,E36+1,FALSE) +(VLOOKUP(E31,HemTableForExpenses,E36+1,FALSE))*(E17+E29))*NumberOfWeeksInAYear,0),0)","v":0},null,{"$f":"IFERROR(IF(AND(G28,NOT(G32)),(VLOOKUP(G30,HemTableForExpenses,G36+1,FALSE) +(VLOOKUP(G31,HemTableForExpenses,G36+1,FALSE))*(G17+G29))*NumberOfWeeksInAYear,0),0)","v":0},null,{"$f":"IFERROR(IF(AND(I28,NOT(I32)),(VLOOKUP(I30,HemTableForExpenses,I36+1,FALSE) +(VLOOKUP(I31,HemTableForExpenses,I36+1,FALSE))*(I17+I29))*NumberOfWeeksInAYear,0),0)","v":0},null,{"$f":"IFERROR(IF(AND(K28,NOT(K32)),(VLOOKUP(K30,HemTableForExpenses,K36+1,FALSE) +(VLOOKUP(K31,HemTableForExpenses,K36+1,FALSE))*(K17+K29))*NumberOfWeeksInAYear,0),0)","v":0},null,{"$f":"IFERROR(IF(AND(M28,NOT(M32)),(VLOOKUP(M30,HemTableForExpenses,M36+1,FALSE) +(VLOOKUP(M31,HemTableForExpenses,M36+1,FALSE))*(M17+M29))*NumberOfWeeksInAYear,0),0)","v":0},null,{"$f":"IFERROR(IF(AND(O28,NOT(O32)),(VLOOKUP(O30,HemTableForExpenses,O36+1,FALSE) +(VLOOKUP(O31,HemTableForExpenses,O36+1,FALSE))*(O17+O29))*NumberOfWeeksInAYear,0),0)","v":0},null,null,0]
[null,null,null,null,null,null,null,null,null,null,"Customer Nominated Living Expenses",null,null,null,null,null,null,{"$f":"SUM(G50:G62)*12","v":0}]
[null,null,null,null,null,null,null,null,null,null,null,null,"Living Expense Used",null,null,null,null,{"$f":"MAX(R40:R41)","v":0}]
[null,null,null,null,null,null,null,null,null,null,null,null,"Net Available Income",null,null,null,null,{"$f":"R39-R42","v":0}]
[]
[]
[]
[null,null,"Commitments"]
[]
[null,null,"Living Expenses:",null,null,null,"Per Month",null,"Other Commitments:",null,null,null,"Per Month"]
[null,null,"Owner occupied property utilities, rates & costs",null,null,null,null,null,"Rent/Board"]
[null,null,"Investment property utilities, rates & costs",null,null,null,null,null,"Total Credit Card Limit",null,null,null,null,34,{"$f":"TEXT(CreditCardCommitments,\"0.00%\")&\": \"&M51*CreditCardCommitments","v":"3.82%: 0"},null,null,{"$f":"M51*CreditCardCommitments","v":0}]
[null,null,"Rented property costs",null,null,null,null,null,"Other Mortgage Repayments"]
[null,null,"Telephone, Internet, Pay TV & Media Streaming",null,null,null,null,null,"Other Liabilities"]
[null,null,"Groceries"]
[null,null,"Recreation & Entertainment"]
[null,null,"Clothing & Personal Care"]
[null,null,"Medical & Health"]
[null,null,"Transport",null,null,null,null,null,null,null,"To assist in verifying the customers living expenses, please provide last 3 months transaction bank statements"]
[null,null,"Insurance"]
[null,null,"Other Living Expenses"]
[null,null,"Education"]
[null,null,"Childcare"]
[]
[]
[null,null,"Results"]
[]
[null,null,"Actual Rate:",null,"Monthly",null,"Annual",null,"Assessment Rate:",null,null,null,"Monthly",null,"Annual"]
[null,null,"Total Income",null,{"$f":"G68/NumberOfMonthsInAYear","v":0},null,{"$f":"$R$27","v":0},null,null,null,"Total Income",null,{"$f":"O68/NumberOfMonthsInAYear","v":0},null,{"$f":"$R$27","v":0}]
[null,null,"Net Income",null,{"$f":"G69/NumberOfMonthsInAYear","v":0},null,{"$f":"$R$39","v":0},null,null,null,"Net Income",null,{"$f":"R39/NumberOfMonthsInAYear","v":0},null,{"$f":"$R$39","v":0}]
[null,null,"Living Costs",null,{"$f":"G70/NumberOfMonthsInAYear","v":0},null,{"$f":"$R$42","v":0},null,null,null,"Living Costs",null,{"$f":"O70/NumberOfMonthsInAYear","v":0},null,{"$f":"$R$42","v":0}]
[null,null,"Net Available Income",null,{"$f":"IFERROR(G71/NumberOfMonthsInAYear,0)","v":0},null,{"$f":"$G$69-$G$70","v":0},null,null,null,"Net Available Income",null,{"$f":"IFERROR(O71/NumberOfMonthsInAYear,0)","v":0},null,{"$f":"$O$69-$O$70","v":0}]
[null,null,"Proposed Repayments",null,{"$f":"IFERROR(-PMT(ResiInterestRate1/NumberOfMonthsInAYear,(ResiLoanTerm1-ResiLoanIOTerm1)*NumberOfMonthsInAYear,ResiNewLoanAmount1),0)+IFERROR(-PMT(ResiInterestRate2/NumberOfMonthsInAYear,(ResiLoanTerm2-ResiLoanIOTerm2)*NumberOfMonthsInAYear,ResiNewLoanAmount2),0)","v":0},null,{"$f":"E72*NumberOfMonthsInAYear","v":0},null,null,null,"Proposed Repayments",null,{"$f":"IFERROR(-PMT(ResiAssessmentRate1/NumberOfMonthsInAYear,(ResiLoanTerm1-ResiLoanIOTerm1)*NumberOfMonthsInAYear,ResiNewLoanAmount1),0)+IFERROR(-PMT(ResiAssessmentRate2/NumberOfMonthsInAYear,(ResiLoanTerm2-ResiLoanIOTerm2)*NumberOfMonthsInAYear,ResiNewLoanAmount2),0)","v":0},null,{"$f":"M72*NumberOfMonthsInAYear","v":0}]
[null,null,"Other Commitments",null,{"$f":"IFERROR(G73/NumberOfMonthsInAYear,0)","v":0},null,{"$f":"O73","v":0},null,null,null,"Other Commitments",null,{"$f":"IFERROR(O73/NumberOfMonthsInAYear,0)","v":0},null,{"$f":"($M$52*OtherMortgageRepaymentBuffer+$M$53+$R$51+$M$50)*NumberOfMonthsInAYear","v":0}]
[]
[null,null,"NSR:",null,{"$f":"IF(K80=\"INCOMPLETE\",0,IFERROR(ROUNDDOWN(G71/(G72+G73),2),0))","v":0},null,{"$f":"IF(OR(ResiCheckForCompleteness=\"INCOMPLETE\",ResiTotalIncome=0),\"INCOMPLETE\",IF(AND(IF(AND(ResiTotalUntaxedAvailableIncome<>0,ResiTotalUntaxedAvailableIncome/ResiTotalIncome>AllowableGovernmentAllowanceOverTotalIncomeLimitation),ResiActualNSR>=AcceptableNSRForGovernmentIncome,TRUE),(ResiActualNSR>=AcceptableNSRForAllOtherApplicants)),\"PASS\",\"FAIL\"))","v":"INCOMPLETE"},null,null,null,"NSR:",null,{"$f":"IF(K80=\"INCOMPLETE\",0,IFERROR(ROUNDDOWN(O71/(O72+O73),2),0))","v":0},null,{"$f":"IF(OR(ResiCheckForCompleteness=\"INCOMPLETE\",ResiTotalIncome=0),\"INCOMPLETE\",IF(AND(IF(AND(ResiTotalUntaxedAvailableIncome<>0,ResiTotalUntaxedAvailableIncome/ResiTotalIncome>AllowableGovernmentAllowanceOverTotalIncomeLimitation),ResiAssessmentNSR>=AcceptableNSRForGovernmentIncome,TRUE),(ResiAssessmentNSR>=AcceptableNSRForAllOtherApplicants)),\"PASS\",\"FAIL\"))","v":"INCOMPLETE"}]
[null,null,"DSR:",null,{"$f":"IF(K80=\"INCOMPLETE\",\"-\",IFERROR((G72+G73-(M50*12))/R27,\"-\"))","v":"-"},null,null,null,null,null,"DSR:",null,{"$f":"IF(K80=\"INCOMPLETE\",\"-\",IFERROR((O72 +O73-(M50*12))/R27,\"-\"))","v":"-"}]
[]
[]
[null,null,null,null,null,null,null,null,null,null,"Application Status"]
[null,null,null,null,null,null,null,null,null,null,{"$f":"IF(OR(ResiNewLoanTotalAmount=\"\",ResiWAVGInterestRate=\"\",ResiWAVGLoanTerm=\"\",E15=\"\",R27=0,E18<>\"\",G18<>\"\",I18<>\"\",K18<>\"\",M18<>\"\",O18<>\"\",M10<=I9,G50=\"\",G51=\"\",G52=\"\",G53=\"\",G54=\"\",G55=\"\",G56=\"\",G57=\"\",G58=\"\",G59=\"\",G60=\"\",G61=\"\",G62=\"\"),\"INCOMPLETE\",\"COMPLETE\")","v":"INCOMPLETE"}]
[]
[null,null,null,null,null,null,"Eligible Loan Amount",null,null,null,null,null,{"$f":"IF(O75=\"INCOMPLETE\",O75,MAX(0,IF(O75=\"PASS\",ResiNewLoanTotalAmount,IFERROR(-PV(ResiWAVGAssessmentRate/12,(ResiWAVGLoanTerm-ResiWAVGLoanIOTerm)*12,ROUNDDOWN(((O71-(O73*(IF(AND(ResiTotalUntaxedAvailableIncome<>0,ResiTotalUntaxedAvailableIncome/ResiTotalIncome>AllowableGovernmentAllowanceOverTotalIncomeLimitation),AcceptableNSRForGovernmentIncome,AcceptableNSRForAllOtherApplicants))))/(NumberOfMonthsInAYear*(IF(AND(ResiTotalUntaxedAvailableIncome<>0,ResiTotalUntaxedAvailableIncome/ResiTotalIncome>AllowableGovernmentAllowanceOverTotalIncomeLimitation),AcceptableNSRForGovernmentIncome,AcceptableNSRForAllOtherApplicants)))),0),0),0))))","v":"INCOMPLETE"}]
[]
[null,null,null,null,null,null,"Maximum Serviceable Loan Amount",null,null,null,null,null,{"$f":"IF(O75=\"INCOMPLETE\",O75,MAX(0,IFERROR(-PV(ResiWAVGAssessmentRate/12,(ResiWAVGLoanTerm-ResiWAVGLoanIOTerm)*12,ROUNDDOWN(((O71-(O73*(IF(AND(ResiTotalUntaxedAvailableIncome<>0,ResiTotalUntaxedAvailableIncome/ResiTotalIncome>AllowableGovernmentAllowanceOverTotalIncomeLimitation),AcceptableNSRForGovernmentIncome,AcceptableNSRForAllOtherApplicants))))/(NumberOfMonthsInAYear*(IF(AND(ResiTotalUntaxedAvailableIncome<>0,ResiTotalUntaxedAvailableIncome/ResiTotalIncome>AllowableGovernmentAllowanceOverTotalIncomeLimitation),AcceptableNSRForGovernmentIncome,AcceptableNSRForAllOtherApplicants)))),0),0),0)))","v":"INCOMPLETE"}]
[null,null,"Net Service Ratio (NSR) Requirements (using Assessment Rate)"]
[null,null,"All applicants: NSR must be ≥ 1.00",null,null,null,null,null,"Where LVR > 90%: NSR must be  ≥ 1.35"]
[null,null,"Construction loans: NSR must be ≥ 1.10"]
[null,null,"Applicants with majority income as Government Allowances (eg. Pensions, Family Tax Benefits): NSR must be ≥ 1.25"]
[null,null,"Important Information:\nThis calculator is to be used as a guide only as to borrowing power based on the basic information provided. It is not an offer of credit or a quote.  Lending criteria, terms and conditions, fees and charges will apply should a borrower apply for credit.\nPepper Money Limited ABN 55 094 317 665 Australian credit licence 286655"]

{"sheet":"SEIC","index":3,"n_rows":72,"n_cols":20,"rows_kept":72,"cut":false,"hidden":false,"merged":[[42,14,42,16],[38,3,38,5],[39,3,39,5],[44,14,44,15],[57,3,57,5],[42,3,42,5],[44,3,44,5],[17,18,17,19],[36,14,36,16],[37,14,37,16],[17,7,17,8],[41,3,41,5],[36,3,36,5],[25,18,25,19],[38,14,38,16],[25,7,25,8],[39,14,39,16],[40,14,40,16],[41,14,41,16],[5,2,5,5],[5,13,5,16],[50,3,50,5],[45,3,45,5],[46,3,46,5],[47,3,47,5],[48,3,48,5],[49,3,49,5],[50,14,50,16],[49,14,49,16],[48,14,48,16],[45,14,45,16],[46,14,46,16],[47,14,47,16],[40,3,40,5],[37,3,37,5]]}
[null,"Self-Employed Income Calculator"]
[]
[null,null,"Business 1",null,null,null,null,null,null,null,null,null,null,"Business 2"]
[]
[null,null,"Business Name",null,null,null,null,null,null,null,null,null,null,"Business Name"]
[]
[null,null,null,"Most\nRecent Year",null,"Previous Year",null,null,null,null,null,null,null,null,"Most\nRecent Year",null,"Previous Year"]
[null,null,"Financial year end date (DD/MM/YYYY)",null,null,null,null,null,null,null,null,null,null,"Financial year end date (DD/MM/YYYY)",null,42551]
[]
[null,null,"Gross Business Income",null,null,null,null,null,null,null,null,null,null,"Gross Business Income"]
[null,null," less expenses ",null,null,null,null,null,null,null,null,null,null," less expenses "]
[null,null," plus superannuation over 9.5%",null,null,null,null,null,null,null,null,null,null," plus superannuation over 9.5%"]
[]
[null,null,"plus depreciation",null,null,null,null,null,null,null,null,null,null,"plus depreciation"]
[null,null," plus interest / leasing charges",null,null,null,null,null,null,null,null,null,null," plus interest / leasing charges"]
[]
[null,null," less Ongoing Business Loan REPAYMENTS",null,null,null,null,null,null,null,null,null,null," less Ongoing Business Loan REPAYMENTS"]
[null,null,null,null,null,null,null,"Total Business Income",null,null,null,null,null,null,null,null,null,null,"Total Business Income"]
[null,null,"Director Wages:",null,null,null,null,"Most Recent Year","Previous Year",null,null,null,null,"Director Wages:",null,null,null,null,"Most Recent Year","Previous Year"]
[null,null,"Applicant 1",null,null,null,null,{"$f":"(D$10-D$11+D$12-D$17)*D28+D20","v":0},{"$f":"(F$10-F$11+F$12-D$17)*F28+F20","v":0},null,null,null,null,"Applicant 1",null,null,null,null,{"$f":"(O$10-O$11+O$12-O$17)*O28+O20","v":0},{"$f":"(Q$10-Q$11+Q$12-O$17)*Q28+Q20","v":0}]
[null,null,"Applicant 2",null,null,null,null,{"$f":"(D$10-D$11+D$12-D$17)*D29+D21","v":0},{"$f":"(F$10-F$11+F$12-D$17)*F29+F21","v":0},null,null,null,null,"Applicant 2",null,null,null,null,{"$f":"(O$10-O$11+O$12-O$17)*O29+O21","v":0},{"$f":"(Q$10-Q$11+Q$12-O$17)*Q29+Q21","v":0}]
[null,null,"Applicant 3",null,null,null,null,0,0,null,null,null,null,"Applicant 3",null,null,null,null,0,0]
[null,null,"Applicant 4",null,null,null,null,0,0,null,null,null,null,"Applicant 4",null,null,null,null,0,0]
[null,null,"Applicant 5",null,null,null,null,0,0,null,null,null,null,"Applicant 5",null,null,null,null,0,0]
[null,null,"Applicant 6",null,null,null,null,0,0,null,null,null,null,"Applicant 6",null,null,null,null,0,0]
[null,null,null,null,null,null,null,"Untaxed Addbacks",null,null,null,null,null,null,null,null,null,null,"Untaxed Addbacks"]
[null,null,"Applicant's Entitlement:",null,null,null,null,"Most Recent Year","Previous Year",null,null,null,null,"Applicant's Entitlement:",null,null,null,null,"Most Recent Year","Previous Year"]
[null,null,"Applicant 1",null,null,null,null,{"$f":"(D$15+D$14)*$D28","v":0},{"$f":"(F$15+F$14)*$F28","v":0},null,null,null,null,"Applicant 1",null,null,null,null,{"$f":"(O$15+O$14)*$O28","v":0},{"$f":"(Q$15+Q$14)*$Q28","v":0}]
[null,null,"Applicant 2",null,null,null,null,0,0,null,null,null,null,"Applicant 2",null,null,null,null,0,0]
[null,null,"Applicant 3",null,null,null,null,0,0,null,null,null,null,"Applicant 3",null,null,null,null,0,0]
[null,null,"Applicant 4",null,null,null,null,0,0,null,null,null,null,"Applicant 4",null,null,null,null,0,0]
[null,null,"Applicant 5",null,null,null,null,0,0,null,null,null,null,"Applicant 5",null,null,null,null,0,0]
[null,null,"Applicant 6",null,null,null,null,0,0,null,null,null,null,"Applicant 6",null,null,null,null,0,0]
[null,null,null,{"$f":"IF(SUM(D28:D33)>100%,\"Check: >100%\",\"\")","v":""},null,{"$f":"IF(SUM(F28:F33)>100%,\"Check\",\"\")","v":""},null,null,null,null,null,null,null,null,{"$f":"IF(SUM(O28:O33)>100%,\"Check: >100%\",\"\")","v":""},null,{"$f":"IF(SUM(Q28:Q33)>100%,\"Check\",\"\")","v":""}]
[null,null,"Calculations: Business 1",null,null,null,null,null,null,null,null,null,null,"Calculations: Business 2"]
[]
[null,null,null,"Self-Employed Income",null,null,null,null,null,null,null,null,null,null,"Self-Employed Income"]
[null,null,"Applicant 1",{"$f":"IF(H20>I20,AVERAGE(H20,I20),H20)","v":0},null,null,null,null,null,null,null,null,null,"Applicant 1",{"$f":"IF(S20>T20,AVERAGE(S20,T20),S20)","v":0}]
[null,null,"Applicant 2",0,null,null,null,null,null,null,null,null,null,"Applicant 2",0]
[null,null,"Applicant 3",0,null,null,null,null,null,null,null,null,null,"Applicant 3",0]
[null,null,"Applicant 4",0,null,null,null,null,null,null,null,null,null,"Applicant 4",0]
[null,null,"Applicant 5",0,null,null,null,null,null,null,null,null,null,"Applicant 5",0]
[null,null,"Applicant 6",0,null,null,null,null,null,null,null,null,null,"Applicant 6",0]
[]
[null,null,null,"Addbacks",null,null,null,null,null,null,null,null,null,null,"Addbacks"]
[null,null,"Applicant 1",{"$f":"IF(H28>I28,AVERAGE(H28,I28),H28)","v":0},null,null,null,null,null,null,null,null,null,"Applicant 1",{"$f":"IF(S28>T28,AVERAGE(S28,T28),S28)","v":0}]
[null,null,"Applicant 2",0,null,null,null,null,null,null,null,null,null,"Applicant 2",0]
[null,null,"Applicant 3",0,null,null,null,null,null,null,null,null,null,"Applicant 3",0]
[null,null,"Applicant 4",0,null,null,null,null,null,null,null,null,null,"Applicant 4",0]
[null,null,"Applicant 5",0,null,null,null,null,null,null,null,null,null,"Applicant 5",0]
[null,null,"Applicant 6",0,null,null,null,null,null,null,null,null,null,"Applicant 6",0]
[]
[]
[]
[]
[null,null,"Outputs"]
[]
[null,null,null,"Self-Employed Income"]
[null,null,"Applicant 1",{"$f":"D38+O38","v":0}]
[null,null,"Applicant 2",0]
[null,null,"Applicant 3",0]
[null,null,"Applicant 4",0]
[null,null,"Applicant 5",0]
[null,null,"Applicant 6",0]
[]
[null,null,null,"Addbacks"]
[null,null,"Applicant 1",{"$f":"D46+O46","v":0}]
[null,null,"Applicant 2",0]
[null,null,"Applicant 3",0]
[null,null,"Applicant 4",0]
[null,null,"Applicant 5",0]
[null,null,"Applicant 6",0]

{"sheet":"HEM Table","index":4,"n_rows":62,"n_cols":19,"rows_kept":62,"cut":false,"hidden":true,"merged":[]}
["Combined Couple Gross Income",null,{"$f":"B2","v":0},{"$f":"C2","v":21000},{"$f":"D2","v":32000},43000,53000,64000,85000,107000,128000,150000,171000,214000,267000,321000,null,null,"Higher income band used as data not available for income band"]
["HEM 2021Q1",null,21000,32000,43000,53000,64000,85000,107000,128000,150000,171000,214000,267000,321000,999999999]
[null,null,1,2,3,4,5,6,7,8,9,10,11,12,13,14]
["Pepper - Proposed"]
["Single","P-S",{"$f":"C25","v":253.974850505474},{"$f":"D25","v":267.72740128080801},280.91590576120001,301.18083848129902,335.31473744669501,387.86759859361598,458.07833923933299,521.63665829856996,604.08089500195297,640.54546717970595,684.78785934524103,793.05126372392294,909.56770759260405,951.74371760491204]
["Couple","P-C",{"$f":"D6","v":495.18574316595698},{"$f":"D20","v":495.18574316595698},508.37260365067999,528.63505747868498,562.76472177884716,615.31110617580703,685.51320317421801,749.06368914251698,831.49776520582805,867.95784339578904,912.1947830149636,1020.4448819536667,1136.94692881489,1179.1177037262901]
["Single parent with 1 child  (per child)","P-SD1",{"$f":"D7","v":91.361337931592345},{"$f":"IF(D26-D25<0,0,D26-D25)","v":91.361337931592345},91.292313966773804,91.186306075060543,91.007699991290565,90.732730694244026,90.365380352841044,90.032809319323064,89.601459621433037,89.410631117987236,89.179181237955277,88.61272088645137,88.003023087624683,87.782422050097921]
["Single parent with 2 children  (per child)","P-SD2",90.082595796983043,{"$f":"IF(D27-D25<0,0,D27-D25)/2","v":90.082595796983043},90.034175965675274,89.959787690386037,89.834472359670514,89.641549960246323,89.383809819884107,89.15047696924205,88.847832086892254,88.713970055311506,88.551546283301263,88.154137296747876,87.726385079227441,87.571537791349897]
["Single parent with 3 children  (per child)","P-SD3",92.897480343722592,{"$f":"E9","v":92.897480343722592},{"$f":"IF(E28-E25<0,0,E28-E25)/3","v":92.897480343722592},92.958212593573421,93.060502181229836,93.218002617232131,93.428426683844165,93.618904114819657,93.865994985326552,93.975291488976268,94.107860486682441,94.432362462618627,94.781554901022943,94.907905930574159]
["Single parent with 4 or more children  (per child)","P-SD4+",92.897480343722592,92.897480343722592,{"$f":"IF(E28-E25<0,0,E28-E25)/3","v":92.897480343722592},92.958212593573421,93.060502181229836,93.218002617232131,93.428426683844165,93.618904114819657,93.865994985326552,93.975291488976268,94.107860486682441,94.432362462618627,94.781554901022943,94.907905930574159]
["Couple with 1 child (per child)","P-CD1",71.690598837918913,71.690598837918913,{"$f":"IF(E21-E20<0,0,E21-E20)","v":71.690598837918913},71.461892164953269,71.076771293224738,70.483764389582234,69.691505728059497,68.974294749319711,68.044011726265921,67.632490002311101,67.133295297592895,65.911576158939624,64.596877700129426,64.121000488125446]
["Couple with 2 children  (per child)","P-CD2",63.51206391059722,63.51206391059722,{"$f":"IF(E22-E20<0,0,E22-E20)/2","v":63.51206391059722},63.377489149965754,63.150863459549043,62.801919928789289,62.335735116188971,61.913707727042777,61.366298891483495,61.124151768632998,60.830406934309053,60.111516338776596,59.337900680999951,59.057858214495013]
["Couple with 3 children  (per child)","P-CD3",62.337612512000341,62.337612512000341,{"$f":"F13","v":62.337612512000341},{"$f":"IF(F23-F20<0,0,F23-F20)/3","v":62.337612512000341},62.225473512982298,62.052827634550987,61.822150799526902,61.613332669060355,61.342479776212599,61.222662085741,61.077328306958783,60.721637734662032,60.338839339693173,60.200312920382807]
["Couple with 4 or more children  (per child)","P-CD4+",{"$f":"D14","v":62.337612512000341},{"$f":"E14","v":62.337612512000341},{"$f":"F14","v":62.337612512000341},{"$f":"IF(F23-F20<0,0,F23-F20)/3","v":62.337612512000341},62.225473512982298,62.052827634550987,61.822150799526902,61.613332669060355,61.342479776212599,61.222662085741,61.077328306958783,60.721637734662032,60.338839339693173,60.200312920382807]
[]
[null,null,1,2,3,4,5,6,7,8,9,10,11,12,13,14]
[null,null,21000,21000,32000,43000,53000,64000,85000,107000,128000,150000,171000,214000,267000,321000]
[null,null,"or less","to","to","to","to","to","to","to","to","to","to","to","to","to"]
["Australia",null,null,32000,43000,53000,64000,85000,107000,128000,150000,171000,214000,267000,321000,534000]
["Couple",null,0,495.18574316595698,508.37260365067999,528.63505747868498,562.76472177884716,615.31110617580703,685.51320317421801,749.06368914251698,831.49776520582805,867.95784339578904,912.1947830149636,1020.4448819536667,1136.94692881489,1179.1177037262901]
["Couple with 1 child",null,0,0,580.0632024885989,600.09694964363825,633.8414930720719,685.79487056538926,755.2047089022775,818.03798389183669,899.54177693209397,935.59033339810014,979.3280783125565,1086.3564581126063,1201.5438065150195,1243.2387042144155]
["Couple with 2 children",null,0,0,635.39673147187443,655.39003577861649,689.06644869794525,740.9149460333856,810.18467340659595,872.89110459660253,954.23036298879504,990.20614693305504,1033.8555968835817,1140.6679146312199,1255.6227301768899,1297.2334201552801]
["Couple with 3 or more children",null,0,0,0,715.64789501468601,749.44114231779406,801.46958907945998,870.97965557279872,933.90368714969804,1015.5252045344658,1051.625829653012,1095.42676793584,1202.6097951576528,1317.9634468339696,1359.7186424874385]
[]
["Single person",null,253.974850505474,267.72740128080801,280.91590576120001,301.18083848129902,335.31473744669501,387.86759859361598,458.07833923933299,521.63665829856996,604.08089500195297,640.54546717970595,684.78785934524103,793.05126372392294,909.56770759260405,951.74371760491204]
["Single parent with 1 child",null,0,359.08873921240036,372.20821972797381,392.36714455635956,426.32243743798557,478.60032928786001,548.44371959217403,611.66946761789302,693.682354623386,729.95609829769319,773.96704058319631,881.66398461037431,997.57073068022873,1039.52613965501]
["Single parent with 2 children",null,0,447.8925928747741,460.98425769255056,481.10041386207109,514.98368216603603,567.15069851410863,636.8459588791012,699.93761223705405,781.77655917573748,817.97340729032896,861.89095191184356,969.3595383174187,1085.0204777510589,1126.8867931876118]
["Single parent with 3 or more children",null,0,0,559.6083467923678,580.05547626201928,614.49624399038453,667.52160644531239,738.36361929086547,802.49337064302892,885.67887995793262,922.47134164663476,967.11144080528834,1076.3483511117788,1193.9123722956729,1236.4674353966345]
[]
[]
[]
[]
[]
[]
[]
["Comparison to prior Benchmark version"]
[]
["HEM 2020Q2"]
[]
[null,null,21000,21000,32000,43000,53000,64000,85000,107000,128000,150000,171000,214000,267000,321000]
[null,null,"or less","to","to","to","to","to","to","to","to","to","to","to","to","to"]
["Australia",null,null,32000,43000,53000,64000,85000,107000,128000,150000,171000,214000,267000,321000,534000]
["Couple",null,0,498.36077043466128,510.51504982075238,533.3119383314812,570.57812390051197,620.46311980650933,689.3746173501919,740.15028206378474,834.99327026090089,855.21930356691041,909.09111124799506,1011.1053856806865,1137.4852940385636,1182.7000301166877]
["Couple with 1 child",null,0,0,582.66300613729845,606.09194633906009,644.39136577017973,695.65947153154627,766.4815937249532,818.66499486333134,916.13763658694666,936.9243941225659,992.28985880564062,1097.1325968269718,1227.0164860406612,1273.4847968933109]
["Couple with 2 children",null,0,0,646.71589706089378,670.35389332299553,708.99505786382292,760.72066727033507,832.17467540157156,884.82380608190715,983.16607717400223,1004.1383929237559,1059.9978827665634,1165.7761308697536,1296.8189719586389,1343.7019188090699]
["Couple with 3 or more children",null,0,0,0,729.44610208514894,767.38509080882875,818.17071929238966,888.32634397790446,940.01867333742143,1036.5739554192221,1057.1651684479773,1112.0095961571274,1215.865615547345,1344.5272617575758,1390.5582655595463]
[]
["Single person",null,256.39287274614333,271.12006845720077,283.32455054891437,306.21556028653123,343.63559033720861,393.72658460709704,462.92260103186658,513.90787523372956,609.14246020165365,629.45204259858667,683.54624341817328,785.98178098667279,912.88353667416504,958.28490279004347]
["Single parent with 1 child",null,0,364.63404851690728,376.97024928337538,400.10831362304526,437.93220966317841,488.56382796522274,558.50662386854617,610.04219291362222,706.30463036241076,726.83334943711986,781.51142739372028,885.05245813565512,1013.3238389191102,1059.2152251443836]
["Single parent with 2 children",null,0,450.55785998616466,462.87185886753059,485.96824974096364,523.72398547183138,574.2644113632582,644.0812107929861,695.52395915452666,791.61298138991037,812.10477977583867,866.68430954550433,970.03889076647806,1098.0791608501979,1143.887883609636]
["Single parent with 3 or more children",null,0,0,539.44773043118994,562.12357271634619,599.19180063100953,648.81196476862976,717.35748760516822,767.86354417067321,862.20289963942298,882.32162710336536,935.90728290264417,1037.3799767127402,1163.0887545072114,1208.0633638822114]
[]
["CHANGE"]
["Couple",null,{"$f":"C20-C43","v":0},{"$f":"D20-D43","v":-3.175027268704298},-2.1424461700723896,-4.6768808527962165,-7.813402121664808,-5.1520136307022995,-3.8614141759738914,8.9134070787322344,-3.4955050550728402,12.738539828878629,3.1036717669685459,9.3394962729802273,-0.53836522367350881,-3.5823263903976112]
["Couple with 1 child",null,{"$f":"C21-C44","v":0},0,-2.5998036486995488,-5.9949966954218326,-10.549872698107833,-9.8646009661570133,-11.276884822675697,-0.62701097149465568,-16.595859654852688,-1.3340607244657576,-12.96178049308412,-10.776138714365516,-25.472679525641752,-30.246092678895366]
["Couple with 2 children",null,{"$f":"C22-C45","v":0},0,-11.319165589019349,-14.963857544379039,-19.928609165877674,-19.805721236949466,{"$f":"I22-I45","v":-21.990001994975614},-11.932701485304619,-28.935714185207189,-13.932245990700835,-26.142285882981696,-25.108216238533714,-41.196241781748995,-46.468498653789766]
["Couple with 3 or more children",null,{"$f":"C23-C46","v":0},0,0,-13.798207070462922,-17.943948491034689,-16.701130212929684,-17.346688405105738,-6.1149861877233889,-21.048750884756259,-5.5393387949652606,-16.5828282212874,-13.25582038969219,-26.563814923606287,-30.83962307210777]
[null,null,{"$f":"C24-C47","v":0},0,0,0,0,0,0,0,0,0,0,0,0,0]
["Single person",null,{"$f":"C25-C48","v":-2.4180222406693304},-3.3926671763927629,-2.4086447877143655,-5.0347218052322091,-8.3208528905136063,-5.8589860134810579,-4.8442617925335867,7.7287830648403997,-5.0615651997006808,11.09342458111928,1.2416159270677554,7.069482737250155,-3.3158290815609917,-6.5411851851314395]
["Single parent with 1 child",null,{"$f":"C26-C49","v":0},-5.5453093045069295,-4.7620295554015684,-7.7411690666856998,-11.609772225192842,-9.9634986773627361,-10.062904276372137,1.6272747042708033,-12.622275739024758,3.1227488605733242,-7.5443868105239744,-3.3884735252808014,-15.753108238881509,-19.68908548937361]
["Single parent with 2 children",null,{"$f":"C27-C50","v":0},-2.6652671113905626,-1.8876011749800341,-4.8678358788925493,-8.7403033057953508,-7.1137128491495787,-7.2352519138848947,4.4136530825273894,-9.8364222141728987,5.8686275144902993,-4.7933576336607757,-0.67935244905936543,-13.058683099138989,-17.001090422024163]
["Single parent with 3 or more children",null,{"$f":"C28-C51","v":0},0,20.160616361177858,17.931903545673094,15.304443359375,18.709641676682622,21.006131685697255,34.629826472355717,23.475980318509642,40.149714543269397,31.20415790264417,38.968374399038566,30.823617788461434,28.404071514423094]

{"sheet":"Validation","index":5,"n_rows":42,"n_cols":26,"rows_kept":42,"cut":false,"hidden":true,"merged":[]}
["Residential","Applicant 1","Applicant 2","Applicant 3","Applicant 4","Applicant 5","Applicant 6",null,"CRE","Applicant 1","Applicant 2","Applicant 3","Applicant 4",null,"CREBetterChoice","Applicant 1","Applicant 2","Applicant 3","Applicant 4",null,null,"Valid Status Resi",null,"Valid Status CRE",null,"Valid Status CREBC"]
["Applicant 1",{"$f":"IF(AND(B$1<>$A2,HLOOKUP($A2,Residential!$E$14:$O$15,2,FALSE)=\"Individual (Couple)\",Residential!E$15=\"Individual (Couple)\"),$A2)","v":false},{"$f":"IF(AND(C$1<>$A2,HLOOKUP($A2,Residential!$E$14:$O$15,2,FALSE)=\"Individual (Couple)\",Residential!G$15=\"Individual (Couple)\"),$A2)","v":false},{"$f":"IF(AND(D$1<>$A2,HLOOKUP($A2,Residential!$E$14:$O$15,2,FALSE)=\"Individual (Couple)\",Residential!I$15=\"Individual (Couple)\"),$A2)","v":false},{"$f":"IF(AND(E$1<>$A2,HLOOKUP($A2,Residential!$E$14:$O$15,2,FALSE)=\"Individual (Couple)\",Residential!K$15=\"Individual (Couple)\"),$A2)","v":false},{"$f":"IF(AND(F$1<>$A2,HLOOKUP($A2,Residential!$E$14:$O$15,2,FALSE)=\"Individual (Couple)\",Residential!M$15=\"Individual (Couple)\"),$A2)","v":false},{"$f":"IF(AND(G$1<>$A2,HLOOKUP($A2,Residential!$E$14:$O$15,2,FALSE)=\"Individual (Couple)\",Residential!O$15=\"Individual (Couple)\"),$A2)","v":false},null,"Applicant 1",{"$f":"IF(AND(J$1<>$I2,HLOOKUP($I2,Commercial!$E$38:$K$39,2,FALSE)=\"Individual (Couple)\",Commercial!E$39=\"Individual (Couple)\"),$I2)","v":false},{"$f":"IF(AND(K$1<>$I2,HLOOKUP($I2,Commercial!$E$38:$K$39,2,FALSE)=\"Individual (Couple)\",Commercial!G$39=\"Individual (Couple)\"),$I2)","v":false},{"$f":"IF(AND(L$1<>$I2,HLOOKUP($I2,Commercial!$E$38:$K$39,2,FALSE)=\"Individual (Couple)\",Commercial!I$39=\"Individual (Couple)\"),$I2)","v":false},{"$f":"IF(AND(M$1<>$I2,HLOOKUP($I2,Commercial!$E$38:$K$39,2,FALSE)=\"Individual (Couple)\",Commercial!K$39=\"Individual (Couple)\"),$I2)","v":false},null,"Applicant 1",{"$f":"IF(AND(P$1<>$O2,HLOOKUP($O2,CommercialBetterChoice!$E$38:$K$39,2,FALSE)=\"Individual (Couple)\",CommercialBetterChoice!E$39=\"Individual (Couple)\"),$O2)","v":false},{"$f":"IF(AND(Q$1<>$O2,HLOOKUP($O2,CommercialBetterChoice!$E$38:$K$39,2,FALSE)=\"Individual (Couple)\",CommercialBetterChoice!G$39=\"Individual (Couple)\"),$O2)","v":false},{"$f":"IF(AND(R$1<>$O2,HLOOKUP($O2,CommercialBetterChoice!$E$38:$K$39,2,FALSE)=\"Individual (Couple)\",CommercialBetterChoice!I$39=\"Individual (Couple)\"),$O2)","v":false},{"$f":"IF(AND(S$1<>$O2,HLOOKUP($O2,CommercialBetterChoice!$E$38:$K$39,2,FALSE)=\"Individual (Couple)\",CommercialBetterChoice!K$39=\"Individual (Couple)\"),$O2)","v":false},null,null,"Company",null,"Individual (Single)",null,"Individual (Single)"]
["Applicant 2",{"$f":"IF(AND(B$1<>$A3,HLOOKUP($A3,Residential!$E$14:$O$15,2,FALSE)=\"Individual (Couple)\",Residential!E$15=\"Individual (Couple)\"),$A3)","v":false},{"$f":"IF(AND(C$1<>$A3,HLOOKUP($A3,Residential!$E$14:$O$15,2,FALSE)=\"Individual (Couple)\",Residential!G$15=\"Individual (Couple)\"),$A3)","v":false},{"$f":"IF(AND(D$1<>$A3,HLOOKUP($A3,Residential!$E$14:$O$15,2,FALSE)=\"Individual (Couple)\",Residential!I$15=\"Individual (Couple)\"),$A3)","v":false},{"$f":"IF(AND(E$1<>$A3,HLOOKUP($A3,Residential!$E$14:$O$15,2,FALSE)=\"Individual (Couple)\",Residential!K$15=\"Individual (Couple)\"),$A3)","v":false},{"$f":"IF(AND(F$1<>$A3,HLOOKUP($A3,Residential!$E$14:$O$15,2,FALSE)=\"Individual (Couple)\",Residential!M$15=\"Individual (Couple)\"),$A3)","v":false},{"$f":"IF(AND(G$1<>$A3,HLOOKUP($A3,Residential!$E$14:$O$15,2,FALSE)=\"Individual (Couple)\",Residential!O$15=\"Individual (Couple)\"),$A3)","v":false},null,"Applicant 2",{"$f":"IF(AND(J$1<>$I3,HLOOKUP($I3,Commercial!$E$38:$K$39,2,FALSE)=\"Individual (Couple)\",Commercial!E$39=\"Individual (Couple)\"),$I3)","v":false},{"$f":"IF(AND(K$1<>$I3,HLOOKUP($I3,Commercial!$E$38:$K$39,2,FALSE)=\"Individual (Couple)\",Commercial!G$39=\"Individual (Couple)\"),$I3)","v":false},{"$f":"IF(AND(L$1<>$I3,HLOOKUP($I3,Commercial!$E$38:$K$39,2,FALSE)=\"Individual (Couple)\",Commercial!I$39=\"Individual (Couple)\"),$I3)","v":false},{"$f":"IF(AND(M$1<>$I3,HLOOKUP($I3,Commercial!$E$38:$K$39,2,FALSE)=\"Individual (Couple)\",Commercial!K$39=\"Individual (Couple)\"),$I3)","v":false},null,"Applicant 2",{"$f":"IF(AND(P$1<>$O3,HLOOKUP($O3,CommercialBetterChoice!$E$38:$K$39,2,FALSE)=\"Individual (Couple)\",CommercialBetterChoice!E$39=\"Individual (Couple)\"),$O3)","v":false},{"$f":"IF(AND(Q$1<>$O3,HLOOKUP($O3,CommercialBetterChoice!$E$38:$K$39,2,FALSE)=\"Individual (Couple)\",CommercialBetterChoice!G$39=\"Individual (Couple)\"),$O3)","v":false},{"$f":"IF(AND(R$1<>$O3,HLOOKUP($O3,CommercialBetterChoice!$E$38:$K$39,2,FALSE)=\"Individual (Couple)\",CommercialBetterChoice!I$39=\"Individual (Couple)\"),$O3)","v":false},{"$f":"IF(AND(S$1<>$O3,HLOOKUP($O3,CommercialBetterChoice!$E$38:$K$39,2,FALSE)=\"Individual (Couple)\",CommercialBetterChoice!K$39=\"Individual (Couple)\"),$O3)","v":false},null,null,"Individual (Single)",null,"Individual (Couple)",null,"Individual (Couple)"]
["Applicant 3",{"$f":"IF(AND(B$1<>$A4,HLOOKUP($A4,Residential!$E$14:$O$15,2,FALSE)=\"Individual (Couple)\",Residential!E$15=\"Individual (Couple)\"),$A4)","v":false},{"$f":"IF(AND(C$1<>$A4,HLOOKUP($A4,Residential!$E$14:$O$15,2,FALSE)=\"Individual (Couple)\",Residential!G$15=\"Individual (Couple)\"),$A4)","v":false},{"$f":"IF(AND(D$1<>$A4,HLOOKUP($A4,Residential!$E$14:$O$15,2,FALSE)=\"Individual (Couple)\",Residential!I$15=\"Individual (Couple)\"),$A4)","v":false},{"$f":"IF(AND(E$1<>$A4,HLOOKUP($A4,Residential!$E$14:$O$15,2,FALSE)=\"Individual (Couple)\",Residential!K$15=\"Individual (Couple)\"),$A4)","v":false},{"$f":"IF(AND(F$1<>$A4,HLOOKUP($A4,Residential!$E$14:$O$15,2,FALSE)=\"Individual (Couple)\",Residential!M$15=\"Individual (Couple)\"),$A4)","v":false},{"$f":"IF(AND(G$1<>$A4,HLOOKUP($A4,Residential!$E$14:$O$15,2,FALSE)=\"Individual (Couple)\",Residential!O$15=\"Individual (Couple)\"),$A4)","v":false},null,"Applicant 3",{"$f":"IF(AND(J$1<>$I4,HLOOKUP($I4,Commercial!$E$38:$K$39,2,FALSE)=\"Individual (Couple)\",Commercial!E$39=\"Individual (Couple)\"),$I4)","v":false},{"$f":"IF(AND(K$1<>$I4,HLOOKUP($I4,Commercial!$E$38:$K$39,2,FALSE)=\"Individual (Couple)\",Commercial!G$39=\"Individual (Couple)\"),$I4)","v":false},{"$f":"IF(AND(L$1<>$I4,HLOOKUP($I4,Commercial!$E$38:$K$39,2,FALSE)=\"Individual (Couple)\",Commercial!I$39=\"Individual (Couple)\"),$I4)","v":false},{"$f":"IF(AND(M$1<>$I4,HLOOKUP($I4,Commercial!$E$38:$K$39,2,FALSE)=\"Individual (Couple)\",Commercial!K$39=\"Individual (Couple)\"),$I4)","v":false},null,"Applicant 3",{"$f":"IF(AND(P$1<>$O4,HLOOKUP($O4,CommercialBetterChoice!$E$38:$K$39,2,FALSE)=\"Individual (Couple)\",CommercialBetterChoice!E$39=\"Individual (Couple)\"),$O4)","v":false},{"$f":"IF(AND(Q$1<>$O4,HLOOKUP($O4,CommercialBetterChoice!$E$38:$K$39,2,FALSE)=\"Individual (Couple)\",CommercialBetterChoice!G$39=\"Individual (Couple)\"),$O4)","v":false},{"$f":"IF(AND(R$1<>$O4,HLOOKUP($O4,CommercialBetterChoice!$E$38:$K$39,2,FALSE)=\"Individual (Couple)\",CommercialBetterChoice!I$39=\"Individual (Couple)\"),$O4)","v":false},{"$f":"IF(AND(S$1<>$O4,HLOOKUP($O4,CommercialBetterChoice!$E$38:$K$39,2,FALSE)=\"Individual (Couple)\",CommercialBetterChoice!K$39=\"Individual (Couple)\"),$O4)","v":false},null,null,"Individual (Couple)"]
["Applicant 4",{"$f":"IF(AND(B$1<>$A5,HLOOKUP($A5,Residential!$E$14:$O$15,2,FALSE)=\"Individual (Couple)\",Residential!E$15=\"Individual (Couple)\"),$A5)","v":false},{"$f":"IF(AND(C$1<>$A5,HLOOKUP($A5,Residential!$E$14:$O$15,2,FALSE)=\"Individual (Couple)\",Residential!G$15=\"Individual (Couple)\"),$A5)","v":false},{"$f":"IF(AND(D$1<>$A5,HLOOKUP($A5,Residential!$E$14:$O$15,2,FALSE)=\"Individual (Couple)\",Residential!I$15=\"Individual (Couple)\"),$A5)","v":false},{"$f":"IF(AND(E$1<>$A5,HLOOKUP($A5,Residential!$E$14:$O$15,2,FALSE)=\"Individual (Couple)\",Residential!K$15=\"Individual (Couple)\"),$A5)","v":false},{"$f":"IF(AND(F$1<>$A5,HLOOKUP($A5,Residential!$E$14:$O$15,2,FALSE)=\"Individual (Couple)\",Residential!M$15=\"Individual (Couple)\"),$A5)","v":false},{"$f":"IF(AND(G$1<>$A5,HLOOKUP($A5,Residential!$E$14:$O$15,2,FALSE)=\"Individual (Couple)\",Residential!O$15=\"Individual (Couple)\"),$A5)","v":false},null,"Applicant 4",{"$f":"IF(AND(J$1<>$I5,HLOOKUP($I5,Commercial!$E$38:$K$39,2,FALSE)=\"Individual (Couple)\",Commercial!E$39=\"Individual (Couple)\"),$I5)","v":false},{"$f":"IF(AND(K$1<>$I5,HLOOKUP($I5,Commercial!$E$38:$K$39,2,FALSE)=\"Individual (Couple)\",Commercial!G$39=\"Individual (Couple)\"),$I5)","v":false},{"$f":"IF(AND(L$1<>$I5,HLOOKUP($I5,Commercial!$E$38:$K$39,2,FALSE)=\"Individual (Couple)\",Commercial!I$39=\"Individual (Couple)\"),$I5)","v":false},{"$f":"IF(AND(M$1<>$I5,HLOOKUP($I5,Commercial!$E$38:$K$39,2,FALSE)=\"Individual (Couple)\",Commercial!K$39=\"Individual (Couple)\"),$I5)","v":false},null,"Applicant 4",{"$f":"IF(AND(P$1<>$O5,HLOOKUP($O5,CommercialBetterChoice!$E$38:$K$39,2,FALSE)=\"Individual (Couple)\",CommercialBetterChoice!$E$39=\"Individual (Couple)\"),$O5)","v":false},{"$f":"IF(AND(Q$1<>$O5,HLOOKUP($O5,CommercialBetterChoice!$E$38:$K$39,2,FALSE)=\"Individual (Couple)\",CommercialBetterChoice!G$39=\"Individual (Couple)\"),$O5)","v":false},{"$f":"IF(AND(R$1<>$O5,HLOOKUP($O5,CommercialBetterChoice!$E$38:$K$39,2,FALSE)=\"Individual (Couple)\",CommercialBetterChoice!I$39=\"Individual (Couple)\"),$O5)","v":false},{"$f":"IF(AND(S$1<>$O5,HLOOKUP($O5,CommercialBetterChoice!$E$38:$K$39,2,FALSE)=\"Individual (Couple)\",CommercialBetterChoice!K$39=\"Individual (Couple)\"),$O5)","v":false}]
["Applicant 5",{"$f":"IF(AND(B$1<>$A6,HLOOKUP($A6,Residential!$E$14:$O$15,2,FALSE)=\"Individual (Couple)\",Residential!E$15=\"Individual (Couple)\"),$A6)","v":false},{"$f":"IF(AND(C$1<>$A6,HLOOKUP($A6,Residential!$E$14:$O$15,2,FALSE)=\"Individual (Couple)\",Residential!G$15=\"Individual (Couple)\"),$A6)","v":false},{"$f":"IF(AND(D$1<>$A6,HLOOKUP($A6,Residential!$E$14:$O$15,2,FALSE)=\"Individual (Couple)\",Residential!I$15=\"Individual (Couple)\"),$A6)","v":false},{"$f":"IF(AND(E$1<>$A6,HLOOKUP($A6,Residential!$E$14:$O$15,2,FALSE)=\"Individual (Couple)\",Residential!K$15=\"Individual (Couple)\"),$A6)","v":false},{"$f":"IF(AND(F$1<>$A6,HLOOKUP($A6,Residential!$E$14:$O$15,2,FALSE)=\"Individual (Couple)\",Residential!M$15=\"Individual (Couple)\"),$A6)","v":false},{"$f":"IF(AND(G$1<>$A6,HLOOKUP($A6,Residential!$E$14:$O$15,2,FALSE)=\"Individual (Couple)\",Residential!O$15=\"Individual (Couple)\"),$A6)","v":false}]
["Applicant 6",{"$f":"IF(AND(B$1<>$A7,HLOOKUP($A7,Residential!$E$14:$O$15,2,FALSE)=\"Individual (Couple)\",Residential!E$15=\"Individual (Couple)\"),$A7)","v":false},{"$f":"IF(AND(C$1<>$A7,HLOOKUP($A7,Residential!$E$14:$O$15,2,FALSE)=\"Individual (Couple)\",Residential!G$15=\"Individual (Couple)\"),$A7)","v":false},{"$f":"IF(AND(D$1<>$A7,HLOOKUP($A7,Residential!$E$14:$O$15,2,FALSE)=\"Individual (Couple)\",Residential!I$15=\"Individual (Couple)\"),$A7)","v":false},{"$f":"IF(AND(E$1<>$A7,HLOOKUP($A7,Residential!$E$14:$O$15,2,FALSE)=\"Individual (Couple)\",Residential!K$15=\"Individual (Couple)\"),$A7)","v":false},{"$f":"IF(AND(F$1<>$A7,HLOOKUP($A7,Residential!$E$14:$O$15,2,FALSE)=\"Individual (Couple)\",Residential!M$15=\"Individual (Couple)\"),$A7)","v":false},{"$f":"IF(AND(G$1<>$A7,HLOOKUP($A7,Residential!$E$14:$O$15,2,FALSE)=\"Individual (Couple)\",Residential!O$15=\"Individual (Couple)\"),$A7)","v":false}]
[]
[null,{"$f":"IF(MID(Residential!E15,13,6)<>\"Couple\",\"\",\"N/A\")","v":""},{"$f":"IF(MID(Residential!G15,13,6)<>\"Couple\",\"\",\"N/A\")","v":""},{"$f":"IF(MID(Residential!I15,13,6)<>\"Couple\",\"\",\"N/A\")","v":""},{"$f":"IF(MID(Residential!K15,13,6)<>\"Couple\",\"\",\"N/A\")","v":""},{"$f":"IF(MID(Residential!M15,13,6)<>\"Couple\",\"\",\"N/A\")","v":""},{"$f":"IF(MID(Residential!O15,13,6)<>\"Couple\",\"\",\"N/A\")","v":""},null,null,{"$f":"IF(MID(Commercial!$E39,13,6)<>\"Couple\",\"\",\"N/A\")","v":""},{"$f":"IF(MID(Commercial!$G39,13,6)<>\"Couple\",\"\",\"N/A\")","v":""},{"$f":"IF(MID(Commercial!$I39,13,6)<>\"Couple\",\"\",\"N/A\")","v":""},{"$f":"IF(MID(Commercial!$K39,13,6)<>\"Couple\",\"\",\"N/A\")","v":""},null,null,{"$f":"IF(MID(CommercialBetterChoice!$E39,13,6)<>\"Couple\",\"\",\"N/A\")","v":""},{"$f":"IF(MID(CommercialBetterChoice!$G39,13,6)<>\"Couple\",\"\",\"N/A\")","v":""},{"$f":"IF(MID(CommercialBetterChoice!$I39,13,6)<>\"Couple\",\"\",\"N/A\")","v":""},{"$f":"IF(MID(CommercialBetterChoice!$K39,13,6)<>\"Couple\",\"\",\"N/A\")","v":""}]
[null,{"$f":"IF(MID(Residential!E15,13,6)<>\"Couple\",\"\",\"Non-loan party\")","v":""},{"$f":"IF(MID(Residential!G15,13,6)<>\"Couple\",\"\",\"Non-loan party\")","v":""},{"$f":"IF(MID(Residential!I15,13,6)<>\"Couple\",\"\",\"Non-loan party\")","v":""},{"$f":"IF(MID(Residential!K15,13,6)<>\"Couple\",\"\",\"Non-loan party\")","v":""},{"$f":"IF(MID(Residential!M15,13,6)<>\"Couple\",\"\",\"Non-loan party\")","v":""},{"$f":"IF(MID(Residential!O15,13,6)<>\"Couple\",\"\",\"Non-loan party\")","v":""},null,null,{"$f":"IF(MID(Commercial!$E39,13,6)<>\"Couple\",\"\",\"Non-loan party\")","v":""},{"$f":"IF(MID(Commercial!$G39,13,6)<>\"Couple\",\"\",\"Non-loan party\")","v":""},{"$f":"IF(MID(Commercial!$I39,13,6)<>\"Couple\",\"\",\"Non-loan party\")","v":""},{"$f":"IF(MID(Commercial!$K39,13,6)<>\"Couple\",\"\",\"Non-loan party\")","v":""},null,null,{"$f":"IF(MID(CommercialBetterChoice!$E39,13,6)<>\"Couple\",\"\",\"Non-loan party\")","v":""},{"$f":"IF(MID(CommercialBetterChoice!$G39,13,6)<>\"Couple\",\"\",\"Non-loan party\")","v":""},{"$f":"IF(MID(CommercialBetterChoice!$I39,13,6)<>\"Couple\",\"\",\"Non-loan party\")","v":""},{"$f":"IF(MID(CommercialBetterChoice!$K39,13,6)<>\"Couple\",\"\",\"Non-loan party\")","v":""}]
[null,{"$f":"IFERROR(INDEX(B$2:B$7,SMALL(IF(ISTEXT(B$2:B$7),ROW(B$1:B$6),\"\"), ROW(B2)-1)),\"-\")","v":"-"},{"$f":"IFERROR(INDEX(C$2:C$7,SMALL(IF(ISTEXT(C$2:C$7),ROW(C$1:C$6),\"\"), ROW(C2)-1)),\"-\")","v":"-"},{"$f":"IFERROR(INDEX(D$2:D$7,SMALL(IF(ISTEXT(D$2:D$7),ROW(D$1:D$6),\"\"), ROW(D2)-1)),\"-\")","v":"-"},{"$f":"IFERROR(INDEX(E$2:E$7,SMALL(IF(ISTEXT(E$2:E$7),ROW(E$1:E$6),\"\"), ROW(E2)-1)),\"-\")","v":"-"},{"$f":"IFERROR(INDEX(F$2:F$7,SMALL(IF(ISTEXT(F$2:F$7),ROW(F$1:F$6),\"\"), ROW(F2)-1)),\"-\")","v":"-"},{"$f":"IFERROR(INDEX(G$2:G$7,SMALL(IF(ISTEXT(G$2:G$7),ROW(G$1:G$6),\"\"), ROW(G2)-1)),\"-\")","v":"-"},null,null,{"$f":"IFERROR(INDEX(J$2:J$5,SMALL(IF(ISTEXT(J$2:J$5),ROW(J$1:J$4),\"\"), ROW(J2)-1)),\"-\")","v":"-"},{"$f":"IFERROR(INDEX(K$2:K$5,SMALL(IF(ISTEXT(K$2:K$5),ROW(K$1:K$4),\"\"), ROW(K2)-1)),\"-\")","v":"-"},{"$f":"IFERROR(INDEX(L$2:L$5,SMALL(IF(ISTEXT(L$2:L$5),ROW(L$1:L$4),\"\"), ROW(L2)-1)),\"-\")","v":"-"},{"$f":"IFERROR(INDEX(M$2:M$5,SMALL(IF(ISTEXT(M$2:M$5),ROW(M$1:M$4),\"\"), ROW(M2)-1)),\"-\")","v":"-"},null,null,{"$f":"IFERROR(INDEX(P$2:P$5,SMALL(IF(ISTEXT(P$2:P$5),ROW(P$1:P$4),\"\"), ROW(P2)-1)),\"-\")","v":"-"},{"$f":"IFERROR(INDEX(Q$2:Q$5,SMALL(IF(ISTEXT(Q$2:Q$5),ROW(Q$1:Q$4),\"\"), ROW(Q2)-1)),\"-\")","v":"-"},{"$f":"IFERROR(INDEX(R$2:R$5,SMALL(IF(ISTEXT(R$2:R$5),ROW(R$1:R$4),\"\"), ROW(R2)-1)),\"-\")","v":"-"},{"$f":"IFERROR(INDEX(S$2:S$5,SMALL(IF(ISTEXT(S$2:S$5),ROW(S$1:S$4),\"\"), ROW(S2)-1)),\"-\")","v":"-"}]
[null,{"$f":"IFERROR(INDEX(B$2:B$7,SMALL(IF(ISTEXT(B$2:B$7),ROW(B$1:B$6),\"\"), ROW(B3)-1)),\"-\")","v":"-"},{"$f":"IFERROR(INDEX(C$2:C$7,SMALL(IF(ISTEXT(C$2:C$7),ROW(C$1:C$6),\"\"), ROW(C3)-1)),\"-\")","v":"-"},{"$f":"IFERROR(INDEX(D$2:D$7,SMALL(IF(ISTEXT(D$2:D$7),ROW(D$1:D$6),\"\"), ROW(D3)-1)),\"-\")","v":"-"},{"$f":"IFERROR(INDEX(E$2:E$7,SMALL(IF(ISTEXT(E$2:E$7),ROW(E$1:E$6),\"\"), ROW(E3)-1)),\"-\")","v":"-"},{"$f":"IFERROR(INDEX(F$2:F$7,SMALL(IF(ISTEXT(F$2:F$7),ROW(F$1:F$6),\"\"), ROW(F3)-1)),\"-\")","v":"-"},{"$f":"IFERROR(INDEX(G$2:G$7,SMALL(IF(ISTEXT(G$2:G$7),ROW(G$1:G$6),\"\"), ROW(G3)-1)),\"-\")","v":"-"},null,null,{"$f":"IFERROR(INDEX(J$2:J$5,SMALL(IF(ISTEXT(J$2:J$5),ROW(J$1:J$4),\"\"), ROW(J3)-1)),\"-\")","v":"-"},{"$f":"IFERROR(INDEX(K$2:K$5,SMALL(IF(ISTEXT(K$2:K$5),ROW(K$1:K$4),\"\"), ROW(K3)-1)),\"-\")","v":"-"},{"$f":"IFERROR(INDEX(L$2:L$5,SMALL(IF(ISTEXT(L$2:L$5),ROW(L$1:L$4),\"\"), ROW(L3)-1)),\"-\")","v":"-"},{"$f":"IFERROR(INDEX(M$2:M$5,SMALL(IF(ISTEXT(M$2:M$5),ROW(M$1:M$4),\"\"), ROW(M3)-1)),\"-\")","v":"-"},null,null,{"$f":"IFERROR(INDEX(P$2:P$5,SMALL(IF(ISTEXT(P$2:P$5),ROW(P$1:P$4),\"\"), ROW(P3)-1)),\"-\")","v":"-"},{"$f":"IFERROR(INDEX(Q$2:Q$5,SMALL(IF(ISTEXT(Q$2:Q$5),ROW(Q$1:Q$4),\"\"), ROW(Q3)-1)),\"-\")","v":"-"},{"$f":"IFERROR(INDEX(R$2:R$5,SMALL(IF(ISTEXT(R$2:R$5),ROW(R$1:R$4),\"\"), ROW(R3)-1)),\"-\")","v":"-"},{"$f":"IFERROR(INDEX(S$2:S$5,SMALL(IF(ISTEXT(S$2:S$5),ROW(S$1:S$4),\"\"), ROW(S3)-1)),\"-\")","v":"-"}]
[null,{"$f":"IFERROR(INDEX(B$2:B$7,SMALL(IF(ISTEXT(B$2:B$7),ROW(B$1:B$6),\"\"), ROW(B4)-1)),\"-\")","v":"-"},{"$f":"IFERROR(INDEX(C$2:C$7,SMALL(IF(ISTEXT(C$2:C$7),ROW(C$1:C$6),\"\"), ROW(C4)-1)),\"-\")","v":"-"},{"$f":"IFERROR(INDEX(D$2:D$7,SMALL(IF(ISTEXT(D$2:D$7),ROW(D$1:D$6),\"\"), ROW(D4)-1)),\"-\")","v":"-"},{"$f":"IFERROR(INDEX(E$2:E$7,SMALL(IF(ISTEXT(E$2:E$7),ROW(E$1:E$6),\"\"), ROW(E4)-1)),\"-\")","v":"-"},{"$f":"IFERROR(INDEX(F$2:F$7,SMALL(IF(ISTEXT(F$2:F$7),ROW(F$1:F$6),\"\"), ROW(F4)-1)),\"-\")","v":"-"},{"$f":"IFERROR(INDEX(G$2:G$7,SMALL(IF(ISTEXT(G$2:G$7),ROW(G$1:G$6),\"\"), ROW(G4)-1)),\"-\")","v":"-"},null,null,{"$f":"IFERROR(INDEX(J$2:J$5,SMALL(IF(ISTEXT(J$2:J$5),ROW(J$1:J$4),\"\"), ROW(J4)-1)),\"-\")","v":"-"},{"$f":"IFERROR(INDEX(K$2:K$5,SMALL(IF(ISTEXT(K$2:K$5),ROW(K$1:K$4),\"\"), ROW(K4)-1)),\"-\")","v":"-"},{"$f":"IFERROR(INDEX(L$2:L$5,SMALL(IF(ISTEXT(L$2:L$5),ROW(L$1:L$4),\"\"), ROW(L4)-1)),\"-\")","v":"-"},{"$f":"IFERROR(INDEX(M$2:M$5,SMALL(IF(ISTEXT(M$2:M$5),ROW(M$1:M$4),\"\"), ROW(M4)-1)),\"-\")","v":"-"},null,null,{"$f":"IFERROR(INDEX(P$2:P$5,SMALL(IF(ISTEXT(P$2:P$5),ROW(P$1:P$4),\"\"), ROW(P4)-1)),\"-\")","v":"-"},{"$f":"IFERROR(INDEX(Q$2:Q$5,SMALL(IF(ISTEXT(Q$2:Q$5),ROW(Q$1:Q$4),\"\"), ROW(Q4)-1)),\"-\")","v":"-"},{"$f":"IFERROR(INDEX(R$2:R$5,SMALL(IF(ISTEXT(R$2:R$5),ROW(R$1:R$4),\"\"), ROW(R4)-1)),\"-\")","v":"-"},{"$f":"IFERROR(INDEX(S$2:S$5,SMALL(IF(ISTEXT(S$2:S$5),ROW(S$1:S$4),\"\"), ROW(S4)-1)),\"-\")","v":"-"}]
[null,{"$f":"IFERROR(INDEX(B$2:B$7,SMALL(IF(ISTEXT(B$2:B$7),ROW(B$1:B$6),\"\"), ROW(B5)-1)),\"-\")","v":"-"},{"$f":"IFERROR(INDEX(C$2:C$7,SMALL(IF(ISTEXT(C$2:C$7),ROW(C$1:C$6),\"\"), ROW(C5)-1)),\"-\")","v":"-"},{"$f":"IFERROR(INDEX(D$2:D$7,SMALL(IF(ISTEXT(D$2:D$7),ROW(D$1:D$6),\"\"), ROW(D5)-1)),\"-\")","v":"-"},{"$f":"IFERROR(INDEX(E$2:E$7,SMALL(IF(ISTEXT(E$2:E$7),ROW(E$1:E$6),\"\"), ROW(E5)-1)),\"-\")","v":"-"},{"$f":"IFERROR(INDEX(F$2:F$7,SMALL(IF(ISTEXT(F$2:F$7),ROW(F$1:F$6),\"\"), ROW(F5)-1)),\"-\")","v":"-"},{"$f":"IFERROR(INDEX(G$2:G$7,SMALL(IF(ISTEXT(G$2:G$7),ROW(G$1:G$6),\"\"), ROW(G5)-1)),\"-\")","v":"-"}]
[null,{"$f":"IFERROR(INDEX(B$2:B$7,SMALL(IF(ISTEXT(B$2:B$7),ROW(B$1:B$6),\"\"), ROW(B6)-1)),\"-\")","v":"-"},{"$f":"IFERROR(INDEX(C$2:C$7,SMALL(IF(ISTEXT(C$2:C$7),ROW(C$1:C$6),\"\"), ROW(C6)-1)),\"-\")","v":"-"},{"$f":"IFERROR(INDEX(D$2:D$7,SMALL(IF(ISTEXT(D$2:D$7),ROW(D$1:D$6),\"\"), ROW(D6)-1)),\"-\")","v":"-"},{"$f":"IFERROR(INDEX(E$2:E$7,SMALL(IF(ISTEXT(E$2:E$7),ROW(E$1:E$6),\"\"), ROW(E6)-1)),\"-\")","v":"-"},{"$f":"IFERROR(INDEX(F$2:F$7,SMALL(IF(ISTEXT(F$2:F$7),ROW(F$1:F$6),\"\"), ROW(F6)-1)),\"-\")","v":"-"},{"$f":"IFERROR(INDEX(G$2:G$7,SMALL(IF(ISTEXT(G$2:G$7),ROW(G$1:G$6),\"\"), ROW(G6)-1)),\"-\")","v":"-"}]
[]
[]
[]
["Dependents Lookup"]
["Dependents","DependedntsCode"]
[0,1]
[1,1]
[2,2]
[3,3]
[4,"4+"]
[]
[]
[]
[]
[]
[]
[]
[]
[]
[]
[]
[null,"Don’t remove","Don’t remove"]
[]
["Servicability Calculator",null,null,null,null,null,null,null,"CRE",null,null,null,null,null,"CREBetterChoice"]
[null,"Applicant 1","Applicant 2","Applicant 3","Applicant 4","Applicant 5","Applicant 6",null,"Applicant 1","Applicant 2","Applicant 3","Applicant 4",null,null,"Applicant 1","Applicant 2","Applicant 3","Applicant 4"]
["Status",null,null,null,null,null,null,null,null,null,null,null,null,null,null,null,0,0]
["Individual (Couple) With",null,null,null,null,null,null,null,null,null,null,null,null,null,null,null,0,0]

{"sheet":"Tax Table","index":6,"n_rows":25,"n_cols":9,"rows_kept":25,"cut":false,"hidden":true,"merged":[[3,0,3,2],[8,0,8,2],[3,4,3,5],[17,0,17,2]]}
[]
[null,null,null,null,null,null,null,null,"This is the Tax Offset for Low income earners"]
[null,null,null,null,null,null,null,null,"https://www.ato.gov.au/individuals/income-and-deductions/offsets-and-rebates/low-income-earners/"]
["Medicare Levy 2017 - 2018",null,null,1,"Tax offset for Low income earners"]
["Threshold","Value","Rate",null,"Thresholds","Max Tax Offset"]
["Minimum for partial levy",21980,0.1,null,37000,445]
["Minimum for full levy",27475,0.02,null,66667]
[]
["Tax 2018-2019"]
["Tax Bracket Min","Tax For Bracket","Tax Rate",null,"Reduced By over 37000K",1.4999999999999999E-2]
[0,0,0]
[18200,0,0.19,2,"Tax offset for Low income earners"]
[37000,{"$f":"(A13-A12)*C12","v":3572},0.32500000000000001,null,"Thresholds","Tax Offset $","Tax Offset%"]
[90000,{"$f":"(A13-A12)*C12+(A14-A13)*C13","v":20797},0.37,null,0,200]
[180000,{"$f":"(A13-A12)*C12+(A14-A13)*C13+(A15-A14)*C14","v":54097},0.45,null,37000,200,0.03]
[999999999,{"$f":"B15","v":54097},0.45,null,48000,530]
[null,null,null,null,90000,530,-1.4999999999999999E-2]
["Tax 2020-2021",null,null,null,999999999,530]
["Tax Bracket Min","Tax For Bracket","Tax Rate",null,null,null,null,null,"This is the  Medicare levy reduction for low income earners"]
[0,0,0,null,null,null,null,null,"https://www.ato.gov.au/Individuals/Medicare-levy/Medicare-levy-reduction-for-low-income-earners/"]
[18200,0,0.19]
[45000,{"$f":"(A22-A21)*C21","v":5092},0.32500000000000001]
[120000,{"$f":"(A22-A21)*C21+(A23-A22)*C22","v":29467},0.37]
[180000,{"$f":"(A22-A21)*C21+(A23-A22)*C22+(A24-A23)*C23","v":51667},0.45]
[999999999,{"$f":"B24","v":51667},0.45]

{"sheet":"Inputs","index":7,"n_rows":46,"n_cols":6,"rows_kept":46,"cut":false,"hidden":true,"merged":[]}
["Inputs"]
[]
["Baseline Assessment Rate",5.5E-2]
[]
["Assessment Loading",2.5000000000000001E-2]
[]
["Credit Card Commitments",3.8199999999999998E-2]
[]
["Workings for Negative Gearing",3.2899999999999999E-2]
[]
["Other Mortgage Repayment Buffer",1.25]
[]
["Rental Income Shading",0.8]
[]
["Company Tax",0.25]
[]
["NumberOfWeeksInAYear",52]
["NumberOfMonthsInAYear",12]
[]
["Acceptable NSR For LVR > 90%",1.35]
["Acceptable NSR For Applicants with majority income as Government Allowances",1.25]
["Acceptable NSR for All other applicants",1]
[]
["Allowable Government Allowance over Total Income Limitation",0.5]
[]
[]
[]
[]
[]
[]
[]
["CRE"]
[null,"Full Doc","Alt Doc","Lease Doc"]
["Minimum ICR",1.4950000000000001,1.7450000000000001,1.7450000000000001]
["Minimum DSCR",1.2450000000000001,1.2450000000000001,1.2450000000000001]
["Minimum DSCR Better Choice",1.4950000000000001,1.4950000000000001,1.4950000000000001]
["Minimum DSCR Better Choice with condition message",1.2450000000000001,1.2450000000000001,1.2450000000000001,null,"Refer BDM"]
[]
[]
["Residenital"]
["Minimum Loan Term in Years",10]
["Maximum Loan Term In years",40]
["Maximum Loan Term In Years For Prime Loans",30]
[]
["Minimum Interest Only Loan term in Years",0]
["Maximum Interest Only Loan term in Years",5]

{"sheet":"Data","index":8,"n_rows":2,"n_cols":153,"rows_kept":2,"cut":false,"hidden":true,"merged":[]}
["Total Loan Amount","WAVG Interest Rate","WAVG Assessment Rate","Max Loan Term","Max IO Term","Loan Amount 1","Interest Rate 1","Assessement Rate 1","Loan Term 1","IO Term 1","Loan Amount 2","Interest Rate 2","Assessment Rate 2","Loan Term 2","IO Term 2","Status 1","Status 2","Status 3","Status 4","Status 5","Status 6","Couple With 1","Couple With 2","Couple With 3","Couple With 4","Couple With 5","Couple With 6","Dependants 1","Dependants 2","Dependants 3","Dependants 4","Dependants 5","Dependants 6","Gross Annual Income 1","Gross Annual Income 2","Gross Annual Income 3","Gross Annual Income 4","Gross Annual Income 5","Gross Annual Income 6","Untaxed Income 1","Untaxed Income 2","Untaxed Income 3","Untaxed Income 4","Untaxed Income 5","Untaxed Income 6","SEIC 1","SEIC 2","SEIC 3","SEIC 4","SEIC 5","SEIC 6","Add Backs 1","Add Backs 2","Add Backs 3","Add Backs 4","Add Backs 5","Add Backs 6","NPBT 1","NPBT 2","NPBT 3","NPBT 4","NPBT 5","NPBT 6","Gross Rental Income 1","Gross Rental Income 2","Gross Rental Income 3","Gross Rental Income 4","Gross Rental Income 5","Gross Rental Income 6","Investment Property Loan Balance 1","Investment Property Loan Balance 2","Investment Property Loan Balance 3","Investment Property Loan Balance 4","Investment Property Loan Balance 5","Investment Property Loan Balance 6","Owner occupied property utilities, rates & costs","Investment property utilities, rates & costs","Rented property costs","Telephone, Internet, Pay TV & Media Streaming","Groceries","Recreation & Entertainment","Clothing & Personal Care","Medical & Health","Transport","Insurance","Other Living Expenses","Education","Childcare","Rent/Board","Total Credit Card Limit","Other Mortgage Repayments","Other Liabilities","Tax Applicant 1","Tax Applicant 2","Tax Applicant 3","Tax Applicant 4","Tax Applicant 5","Tax Applicant 6","Net Income Applicant 1","Net Income Applicant 2","Net Income Applicant 3","Net Income Applicant 4","Net Income Applicant 5","Net Income Applicant 6","Net Income Total","Hem Living Expense Applicant 1","Hem Living Expense Applicant 2","Hem Living Expense Applicant 3","Hem Living Expense Applicant 4","Hem Living Expense Applicant 5","Hem Living Expense Applicant 6","Hem Living Expense Total","Customer Nominated Living Expenses","Living Expense Used","Net Available Income","Baseline Assessment Rate","Assessment Loading","Credit Card Commitments","Workings for Negative Gearing","Other Mortgage Repayment Buffer","Rental Income Shading","Company Tax","Actual Rate Monthly Total Income","Actual Rate Monthly - Net Income","Actual Rate Monthly - Living Costs","Actual Rate Monthly - Net Available Income","Actual Rate Monthly - Proposed Repayments","Actual Rate Monthly - Other Commitments","Actual Rate Annually Total Income","Actual Rate Annually - Net Income","Actual Rate Annually - Living Costs","Actual Rate Annually - Net Available Income","Actual Rate Annually - Proposed Repayments","Actual Rate Annually - Other Commitments","Assessment Rate Monthly Total Income","Assessment Rate Monthly - Net Income","Assessment Rate Monthly - Living Costs","Assessment Rate Monthly - Net Available Income","Assessment Rate Monthly - Proposed Repayments","Assessment Rate Monthly - Other Commitments","Assessment Rate Annually Total Income","Assessment Rate Annually - Net Income","Assessment Rate Annually - Living Costs","Assessment Rate Annually - Net Available Income","Assessment Rate Annually - Proposed Repayments","Assessment Rate Annually - Other Commitments","Actual NSR","Actual DSR","Actual Results","Assessment NSR","Assessment DSR","Assessment Results","Allowable Income"]
[{"$f":"ResiNewLoanTotalAmount","v":0},{"$f":"ResiWAVGInterestRate","v":0},{"$f":"ResiWAVGAssessmentRate","v":5.5E-2},{"$f":"ResiWAVGLoanTerm","v":0},{"$f":"Residential!P12","v":0},{"$f":"ResiNewLoanAmount1","v":0},{"$f":"ResiInterestRate1","v":0},{"$f":"MAX(BaselineAssessmentRate,ResiInterestRate1+AssessmentLoading)","v":5.5E-2},{"$f":"ResiLoanTerm1","v":0},{"$f":"ResiLoanIOTerm1","v":0},{"$f":"ResiNewLoanAmount2","v":0},null,{"$f":"MAX(BaselineAssessmentRate,ResiInterestRate2+AssessmentLoading)","v":5.5E-2},{"$f":"ResiLoanTerm2","v":0},{"$f":"ResiLoanIOTerm2","v":0},{"$f":"IF(Residential!$E$15=\"\",\"\",Residential!$E$15)","v":""},{"$f":"IF(Residential!$G$15=\"\",\"\",Residential!$G$15)","v":""},{"$f":"IF(Residential!$I$15=\"\",\"\",Residential!$I$15)","v":""},{"$f":"IF(Residential!$K$15=\"\",\"\",Residential!$K$15)","v":""},{"$f":"IF(Residential!$M$15=\"\",\"\",Residential!$M$15)","v":""},{"$f":"IF(Residential!$O$15=\"\",\"\",Residential!$O$15)","v":""},{"$f":"IF(Residential!$E$16=\"\",\"\",Residential!$E$16)","v":""},{"$f":"IF(Residential!$G$16=\"\",\"\",Residential!$G$16)","v":""},{"$f":"IF(Residential!$I$16=\"\",\"\",Residential!$I$16)","v":""},{"$f":"IF(Residential!$K$16=\"\",\"\",Residential!$K$16)","v":""},{"$f":"IF(Residential!$M$16=\"\",\"\",Residential!$M$16)","v":""},{"$f":"IF(Residential!$O$16=\"\",\"\",Residential!$O$16)","v":""},{"$f":"IF(Residential!$E$17=\"\",\"\",Residential!$E$17)","v":""},{"$f":"IF(Residential!$G$17=\"\",\"\",Residential!$G$17)","v":""},{"$f":"IF(Residential!$I$17=\"\",\"\",Residential!$I$17)","v":""},{"$f":"IF(Residential!$K$17=\"\",\"\",Residential!$K$17)","v":""},{"$f":"IF(Residential!$M$17=\"\",\"\",Residential!$M$17)","v":""},{"$f":"IF(Residential!$O$17=\"\",\"\",Residential!$O$17)","v":""},{"$f":"Residential!$E$19","v":0},{"$f":"Residential!$G$19","v":0},{"$f":"Residential!$I$19","v":0},{"$f":"Residential!$K$19","v":0},{"$f":"Residential!$M$19","v":0},{"$f":"Residential!$O$19","v":0},{"$f":"Residential!$E$20","v":0},{"$f":"Residential!$G$20","v":0},{"$f":"Residential!$I$20","v":0},{"$f":"Residential!$K$20","v":0},{"$f":"Residential!$M$20","v":0},{"$f":"Residential!$O$20","v":0},{"$f":"Residential!$E$21","v":0},{"$f":"Residential!$G$21","v":0},{"$f":"Residential!$I$21","v":0},{"$f":"Residential!$K$21","v":0},{"$f":"Residential!$M$21","v":0},{"$f":"Residential!$O$21","v":0},{"$f":"Residential!$E$22","v":0},{"$f":"Residential!$G$22","v":0},{"$f":"Residential!$I$22","v":0},{"$f":"Residential!$K$22","v":0},{"$f":"Residential!$M$22","v":0},{"$f":"Residential!$O$22","v":0},{"$f":"Residential!$E$23","v":0},{"$f":"Residential!$G$23","v":0},{"$f":"Residential!$I$23","v":0},{"$f":"Residential!$K$23","v":0},{"$f":"Residential!$M$23","v":0},{"$f":"Residential!$O$23","v":0},{"$f":"Residential!$E$25","v":0},{"$f":"Residential!$G$25","v":0},{"$f":"Residential!$I$25","v":0},{"$f":"Residential!$K$25","v":0},{"$f":"Residential!$M$25","v":0},{"$f":"Residential!$O$25","v":0},{"$f":"Residential!$E$26","v":0},{"$f":"Residential!$G$26","v":0},{"$f":"Residential!$I$26","v":0},{"$f":"Residential!$K$26","v":0},{"$f":"Residential!$M$26","v":0},{"$f":"Residential!$O$26","v":0},{"$f":"Residential!$G$50","v":0},{"$f":"Residential!$G$51","v":0},{"$f":"Residential!$G$52","v":0},{"$f":"Residential!$G$53","v":0},{"$f":"Residential!$G$54","v":0},{"$f":"Residential!$G$55","v":0},{"$f":"Residential!$G$56","v":0},{"$f":"Residential!$G$57","v":0},{"$f":"Residential!$G$58","v":0},{"$f":"Residential!$G$59","v":0},{"$f":"Residential!$G$60","v":0},{"$f":"Residential!$G$61","v":0},{"$f":"Residential!$G$62","v":0},{"$f":"Residential!$M$50","v":0},{"$f":"Residential!$M$51","v":0},{"$f":"Residential!$M$52","v":0},{"$f":"Residential!$M$53","v":0},{"$f":"Residential!$E$37","v":0},{"$f":"Residential!$G$37","v":0},{"$f":"Residential!$I$37","v":0},{"$f":"Residential!$K$37","v":0},{"$f":"Residential!$M$37","v":0},{"$f":"Residential!$O$37","v":0},{"$f":"Residential!$E$39","v":0},{"$f":"Residential!$G$39","v":0},{"$f":"Residential!$I$39","v":0},{"$f":"Residential!$K$39","v":0},{"$f":"Residential!$M$39","v":0},{"$f":"Residential!$O$39","v":0},{"$f":"Residential!$R$39","v":0},{"$f":"Residential!$E$40","v":0},{"$f":"Residential!$G$40","v":0},{"$f":"Residential!$I$40","v":0},{"$f":"Residential!$K$40","v":0},{"$f":"Residential!$M$40","v":0},{"$f":"Residential!$O$40","v":0},{"$f":"Residential!$R$40","v":0},{"$f":"Residential!$R$41","v":0},{"$f":"Residential!$R$42","v":0},{"$f":"Residential!$R$43","v":0},{"$f":"BaselineAssessmentRate","v":5.5E-2},{"$f":"AssessmentLoading","v":2.5000000000000001E-2},{"$f":"CreditCardCommitments","v":3.8199999999999998E-2},{"$f":"WorkingsForNegativeGearing","v":3.2899999999999999E-2},{"$f":"OtherMortgageRepaymentBuffer","v":1.25},{"$f":"RentalIncomeShading","v":0.8},{"$f":"CompanyTax","v":0.25},{"$f":"ROUND(Residential!$E$68,2)","v":0},{"$f":"ROUND(Residential!$E$69,2)","v":0},{"$f":"ROUND(Residential!$E$70,2)","v":0},{"$f":"ROUND(Residential!$E$71,2)","v":0},{"$f":"ROUND(Residential!$E$72,2)","v":0},{"$f":"ROUND(Residential!$E$73,2)","v":0},{"$f":"ROUND(Residential!$G$68,2)","v":0},{"$f":"ROUND(Residential!$G$69,2)","v":0},{"$f":"ROUND(Residential!$G$70,2)","v":0},{"$f":"ROUND(Residential!$G$71,2)","v":0},{"$f":"ROUND(Residential!$G$72,2)","v":0},{"$f":"ROUND(Residential!$G$73,2)","v":0},{"$f":"ROUND(Residential!$M$68,2)","v":0},{"$f":"ROUND(Residential!$M$69,2)","v":0},{"$f":"ROUND(Residential!$M$70,2)","v":0},{"$f":"ROUND(Residential!$M$71,2)","v":0},{"$f":"ROUND(Residential!$M$72,2)","v":0},{"$f":"ROUND(Residential!$M$73,2)","v":0},{"$f":"ROUND(Residential!$O$68,2)","v":0},{"$f":"ROUND(Residential!$O$69,2)","v":0},{"$f":"ROUND(Residential!$O$70,2)","v":0},{"$f":"ROUND(Residential!$O$71,2)","v":0},{"$f":"ROUND(Residential!$O$72,2)","v":0},{"$f":"ROUND(Residential!$O$73,2)","v":0},{"$f":"Residential!$E$75","v":0},{"$f":"Residential!$E$76","v":"-"},{"$f":"Residential!$G$75","v":"INCOMPLETE"},{"$f":"Residential!$M$75","v":0},{"$f":"Residential!$M$76","v":"-"},{"$f":"Residential!$O$75","v":"INCOMPLETE"},{"$f":"IF(Residential!$M$82<>\"Incomplete\",ROUND(Residential!$M$82,2),Residential!$M$82)","v":"INCOMPLETE"}]

{"sheet":"CommercialData","index":9,"n_rows":3,"n_cols":113,"rows_kept":3,"cut":false,"hidden":true,"merged":[]}
["Proposed Loan Details",null,null,null,null,"Business Loan Details",null,null,null,null,null,null,null,null,null,null,null,"Business Income / Expenses (Income)",null,null,"Business Income / Expenses (Add Backs)",null,null,null,null,"Personal Income / Expenses",null,null,null,null,null,null,null,null,null,null,null,null,null,null,null,null,null,null,null,null,null,null,null,null,null,null,null,null,null,null,null,null,null,null,null,null,null,null,null,null,null,null,null,null,null,null,null,null,null,null,null,null,null,null,"Calculation",null,null,null,null,null,null,null,null,null,null,null,null,null,null,null,null,null,"Inputs",null,null,null,null,null,null,"Results"]
["New Loan Amount","Interest Rate","Documentation Type","Loan Term (Years)","I/O Term (Years)","Loan Amount 1","Rate 1","Actual Loan Repayment (Monthly) 1","Loan Amount 2","Rate 2","Actual Loan Repayment (Monthly) 2","Loan Amount 3","Rate 3","Actual Loan Repayment (Monthly) 3","Loan Amount 4","Rate 4","Actual Loan Repayment (Monthly) 4","Net Profit Before Tax","Proposed Net CRE Rental Income","Proposed Gross Residential Rental Income","Depreciation","Ammortisation","Interest Paid","Directors Salaries/ Fees / Super","Other","Status Applicant 1","Status Applicant 2","Status Applicant 3","Status Applicant 4","Couple with  Applicant 1","Couple with  Applicant 2","Couple with  Applicant 3","Couple with  Applicant 4","Dependent Applicant 1","Dependent Applicant 2","Dependent Applicant 3","Dependent Applicant 4","Gross Annual Income Applicant 1","Gross Annual Income Applicant 2","Gross Annual Income Applicant 3","Gross Annual Income Applicant 4","Untaxed Allowable Income Applicant 1","Untaxed Allowable Income Applicant 2","Untaxed Allowable Income Applicant 3","Untaxed Allowable Income Applicant 4","Gross Residential Rental Income (Other) Applicant 1","Gross Residential Rental Income (Other) Applicant 2","Gross Residential Rental Income (Other) Applicant 3","Gross Residential Rental Income (Other) Applicant 4","Investment Property Loan Balance (personal name) Applicant 1","Investment Property Loan Balance (personal name) Applicant 2","Investment Property Loan Balance (personal name) Applicant 3","Investment Property Loan Balance (personal name) Applicant 4","Living Expenses Monthly (Declared Living Expenses)","Rent/Board","Total Credit Card Limit","Personal Mortgage Repayments","Other Consumer Debt","P&I Repayment","IO Repayment","Earning Before Interest, Tax, Depreciation & Ammortisation (EBITDA)"," Total Add Backs","Total Income Applicant 1","Total Income Applicant 2","Total Income Applicant 3","Total Income Applicant 4","Total Gross Annual Income of All Applicants","Tax Applicant 1","Tax Applicant 2","Tax Applicant 3","Tax Applicant 4","Tax offset for Low Income Earners Applicant 1","Tax offset for Low Income Earners Applicant 2","Tax offset for Low Income Earners Applicant 3","Tax offset for Low Income Earners Applicant 4","Total Net Annual Income Applicant 1","Total Net Annual Income Applicant 2","Total Net Annual Income Applicant 3","Total Net Annual Income Applicant 4","Total Net Annual Income of All Applicants","Total Taxable Income Applicant 1","Total Taxable Income Applicant 2","Total Taxable Income Applicant 3","Total Taxable Income Applicant 4","Total Taxable Income For All Applicants","Spouse Income Applicant 1","Spouse Income Applicant 2","Spouse Income Applicant 3","Spouse Income Applicant 4","Hem Living Expense Applicant 1","Hem Living Expense Applicant 2","Hem Living Expense Applicant 3","Hem Living Expense Applicant 4","Hem Living Expense Total","Customer Nominated Living Expenses","Used Living Expenses","Personal rent","Personal Debt","Baseline Assessment Rate","Assessment Loading","Credit Card Commitments","Workings for Negative Gearing","Other Mortgage Repayment Buffer","Rental Income Shading","Company Tax","Business income (EBITDA + net personal contribution)","Interest Expenses","Debt Repayments","Interest Coverage Ratio (ICR) %","Debt Service Coverage Ratio (DSCR) %","Interest Coverage Ratio (ICR) Flag","Debt Service Coverage Ratio (DSCR) Flag","Application Status Flag"]
[{"$f":"Commercial!$E$8","v":0},{"$f":"Commercial!$I$8","v":0},{"$f":"Commercial!$E$9","v":0},{"$f":"Commercial!$I$9","v":0},{"$f":"Commercial!$I$10","v":0},{"$f":"Commercial!$E$18","v":0},{"$f":"Commercial!$G$18","v":0},{"$f":"Commercial!$I$18","v":0},{"$f":"Commercial!$E$19","v":0},{"$f":"Commercial!$G$19","v":0},{"$f":"Commercial!$I$19","v":0},{"$f":"Commercial!$E$20","v":0},{"$f":"Commercial!$G$20","v":0},{"$f":"Commercial!$I$20","v":0},{"$f":"Commercial!$E$21","v":0},{"$f":"Commercial!$G$21","v":0},{"$f":"Commercial!$I$21","v":0},{"$f":"Commercial!$E$27","v":0},{"$f":"Commercial!$E$28","v":0},{"$f":"Commercial!$E$29","v":0},{"$f":"Commercial!$K$27","v":0},{"$f":"Commercial!$K$28","v":0},{"$f":"Commercial!$K$29","v":0},{"$f":"Commercial!$K$30","v":0},{"$f":"Commercial!$K$31","v":0},{"$f":"Commercial!$E$39","v":0},{"$f":"Commercial!$G$39","v":0},{"$f":"Commercial!$I$39","v":0},{"$f":"Commercial!$K$39","v":0},{"$f":"Commercial!$E$40","v":0},{"$f":"Commercial!$G$40","v":0},{"$f":"Commercial!$I$40","v":0},{"$f":"Commercial!$K$40","v":0},{"$f":"Commercial!$E$41","v":0},{"$f":"Commercial!$G$41","v":0},{"$f":"Commercial!$I$41","v":0},{"$f":"Commercial!$K$41","v":0},{"$f":"Commercial!$E$44","v":0},{"$f":"Commercial!$G$44","v":0},{"$f":"Commercial!$I$44","v":0},{"$f":"Commercial!$K$44","v":0},{"$f":"Commercial!$E$45","v":0},{"$f":"Commercial!$G$45","v":0},{"$f":"Commercial!$I$45","v":0},{"$f":"Commercial!$K$45","v":0},{"$f":"Commercial!$E$46","v":0},{"$f":"Commercial!$G$46","v":0},{"$f":"Commercial!$I$46","v":0},{"$f":"Commercial!$K$46","v":0},{"$f":"Commercial!$E$49","v":0},{"$f":"Commercial!$G$49","v":0},{"$f":"Commercial!$I$49","v":0},{"$f":"Commercial!$K$49","v":0},{"$f":"Commercial!$E$55","v":0},{"$f":"Commercial!$K$55","v":0},{"$f":"Commercial!$K$56","v":0},{"$f":"Commercial!$K$57","v":0},{"$f":"Commercial!$K$58","v":0},{"$f":"Commercial!$I$11","v":0},{"$f":"Commercial!$I$12","v":0},{"$f":"Commercial!$E$33","v":0},{"$f":"Commercial!$K$33","v":0},{"$f":"Commercial!$E$47","v":0},{"$f":"Commercial!$G$47","v":0},{"$f":"Commercial!$I$47","v":0},{"$f":"Commercial!$K$47","v":0},{"$f":"Commercial!$P$47","v":0},{"$f":"Commercial!$E$50","v":0},{"$f":"Commercial!$G$50","v":0},{"$f":"Commercial!$I$50","v":0},{"$f":"Commercial!$K$50","v":0},{"$f":"Commercial!$E$51","v":0},{"$f":"Commercial!$G$51","v":0},{"$f":"Commercial!$I$51","v":0},{"$f":"Commercial!$K$51","v":0},{"$f":"Commercial!$E$52","v":0},{"$f":"Commercial!$G$52","v":0},{"$f":"Commercial!$I$52","v":0},{"$f":"Commercial!$K$52","v":0},{"$f":"Commercial!$P$52","v":0},{"$f":"Commercial!$E$66","v":0},{"$f":"Commercial!$G$66","v":0},{"$f":"Commercial!$I$66","v":0},{"$f":"Commercial!$K$66","v":0},{"$f":"Commercial!$P$66","v":0},{"$f":"Commercial!$E$67","v":0},{"$f":"Commercial!$G$67","v":0},{"$f":"Commercial!$I$67","v":0},{"$f":"Commercial!$K$67","v":0},{"$f":"Commercial!$E$69","v":0},{"$f":"Commercial!$G$69","v":0},{"$f":"Commercial!$I$69","v":0},{"$f":"Commercial!$K$69","v":0},{"$f":"Commercial!$P$69","v":0},{"$f":"Commercial!$P$70","v":0},{"$f":"Commercial!$P$71","v":0},{"$f":"Commercial!$P$72","v":0},{"$f":"Commercial!$P$73","v":0},{"$f":"BaselineAssessmentRate","v":5.5E-2},{"$f":"AssessmentLoading","v":2.5000000000000001E-2},{"$f":"CreditCardCommitments","v":3.8199999999999998E-2},{"$f":"WorkingsForNegativeGearing","v":3.2899999999999999E-2},{"$f":"OtherMortgageRepaymentBuffer","v":1.25},{"$f":"RentalIncomeShading","v":0.8},{"$f":"CompanyTax","v":0.25},{"$f":"Commercial!$E$81","v":0},{"$f":"Commercial!$I$81","v":0},{"$f":"Commercial!$I$82","v":0},{"$f":"Commercial!$I$85","v":0},{"$f":"Commercial!$I$86","v":0},{"$f":"Commercial!$K$85","v":"INCOMPLETE"},{"$f":"Commercial!$K$86","v":"INCOMPLETE"},{"$f":"Commercial!$I$89","v":"INCOMPLETE"}]

{"sheet":"CommercialDataBetterChoice","index":10,"n_rows":3,"n_cols":113,"rows_kept":3,"cut":false,"hidden":true,"merged":[]}
["Proposed Loan Details",null,null,null,null,"Business Loan Details",null,null,null,null,null,null,null,null,null,null,null,"Business Income / Expenses (Income)",null,null,"Business Income / Expenses (Add Backs)",null,null,null,null,"Personal Income / Expenses",null,null,null,null,null,null,null,null,null,null,null,null,null,null,null,null,null,null,null,null,null,null,null,null,null,null,null,null,null,null,null,null,null,null,null,null,null,null,null,null,null,null,null,null,null,null,null,null,null,null,null,null,null,null,"Calculation",null,null,null,null,null,null,null,null,null,null,null,null,null,null,null,null,null,"Inputs",null,null,null,null,null,null,"Results"]
["New Loan Amount","Interest Rate","Documentation Type","Loan Term (Years)","I/O Term (Years)","Loan Amount 1","Rate 1","Actual Loan Repayment (Monthly) 1","Loan Amount 2","Rate 2","Actual Loan Repayment (Monthly) 2","Loan Amount 3","Rate 3","Actual Loan Repayment (Monthly) 3","Loan Amount 4","Rate 4","Actual Loan Repayment (Monthly) 4","Net Profit Before Tax","Proposed Net CRE Rental Income","Proposed Gross Residential Rental Income","Depreciation","Ammortisation","Interest Paid","Directors Salaries/ Fees / Super","Other","Status Applicant 1","Status Applicant 2","Status Applicant 3","Status Applicant 4","Couple with  Applicant 1","Couple with  Applicant 2","Couple with  Applicant 3","Couple with  Applicant 4","Dependent Applicant 1","Dependent Applicant 2","Dependent Applicant 3","Dependent Applicant 4","Gross Annual Income Applicant 1","Gross Annual Income Applicant 2","Gross Annual Income Applicant 3","Gross Annual Income Applicant 4","Untaxed Allowable Income Applicant 1","Untaxed Allowable Income Applicant 2","Untaxed Allowable Income Applicant 3","Untaxed Allowable Income Applicant 4","Gross Residential Rental Income (Other) Applicant 1","Gross Residential Rental Income (Other) Applicant 2","Gross Residential Rental Income (Other) Applicant 3","Gross Residential Rental Income (Other) Applicant 4","Investment Property Loan Balance (personal name) Applicant 1","Investment Property Loan Balance (personal name) Applicant 2","Investment Property Loan Balance (personal name) Applicant 3","Investment Property Loan Balance (personal name) Applicant 4","Living Expenses Monthly (Declared Living Expenses)","Rent/Board","Total Credit Card Limit","Personal Mortgage Repayments","Other Consumer Debt","P&I Repayment","IO Repayment","Earning Before Interest, Tax, Depreciation & Ammortisation (EBITDA)"," Total Add Backs","Total Income Applicant 1","Total Income Applicant 2","Total Income Applicant 3","Total Income Applicant 4","Total Gross Annual Income of All Applicants","Tax Applicant 1","Tax Applicant 2","Tax Applicant 3","Tax Applicant 4","Tax offset for Low Income Earners Applicant 1","Tax offset for Low Income Earners Applicant 2","Tax offset for Low Income Earners Applicant 3","Tax offset for Low Income Earners Applicant 4","Total Net Annual Income Applicant 1","Total Net Annual Income Applicant 2","Total Net Annual Income Applicant 3","Total Net Annual Income Applicant 4","Total Net Annual Income of All Applicants","Total Taxable Income Applicant 1","Total Taxable Income Applicant 2","Total Taxable Income Applicant 3","Total Taxable Income Applicant 4","Total Taxable Income For All Applicants","Spouse Income Applicant 1","Spouse Income Applicant 2","Spouse Income Applicant 3","Spouse Income Applicant 4","Hem Living Expense Applicant 1","Hem Living Expense Applicant 2","Hem Living Expense Applicant 3","Hem Living Expense Applicant 4","Hem Living Expense Total","Customer Nominated Living Expenses","Used Living Expenses","Personal rent","Personal Debt","Baseline Assessment Rate","Assessment Loading","Credit Card Commitments","Workings for Negative Gearing","Other Mortgage Repayment Buffer","Rental Income Shading","Company Tax","Business income (EBITDA + net personal contribution)","Interest Expenses","Debt Repayments","Interest Coverage Ratio (ICR) %","Debt Service Coverage Ratio (DSCR) %","Interest Coverage Ratio (ICR) Flag","Debt Service Coverage Ratio (DSCR) Flag","Application Status Flag"]
[{"$f":"CommercialBetterChoice!$E$8","v":0},{"$f":"CommercialBetterChoice!$I$8","v":0},{"$f":"CommercialBetterChoice!$E$9","v":0},{"$f":"CommercialBetterChoice!$I$9","v":0},{"$f":"CommercialBetterChoice!$I$10","v":0},{"$f":"CommercialBetterChoice!$E$18","v":0},{"$f":"CommercialBetterChoice!$G$18","v":0},{"$f":"CommercialBetterChoice!$I$18","v":0},{"$f":"CommercialBetterChoice!$E$19","v":0},{"$f":"CommercialBetterChoice!$G$19","v":0},{"$f":"CommercialBetterChoice!$I$19","v":0},{"$f":"CommercialBetterChoice!$E$20","v":0},{"$f":"CommercialBetterChoice!$G$20","v":0},{"$f":"CommercialBetterChoice!$I$20","v":0},{"$f":"CommercialBetterChoice!$E$21","v":0},{"$f":"CommercialBetterChoice!$G$21","v":0},{"$f":"CommercialBetterChoice!$I$21","v":0},{"$f":"CommercialBetterChoice!$E$27","v":0},{"$f":"CommercialBetterChoice!$E$28","v":0},{"$f":"CommercialBetterChoice!$E$29","v":0},{"$f":"CommercialBetterChoice!$K$27","v":0},{"$f":"CommercialBetterChoice!$K$28","v":0},{"$f":"CommercialBetterChoice!$K$29","v":0},{"$f":"CommercialBetterChoice!$K$30","v":0},{"$f":"CommercialBetterChoice!$K$31","v":0},{"$f":"CommercialBetterChoice!$E$39","v":0},{"$f":"CommercialBetterChoice!$G$39","v":0},{"$f":"CommercialBetterChoice!$I$39","v":0},{"$f":"CommercialBetterChoice!$K$39","v":0},{"$f":"CommercialBetterChoice!$E$40","v":0},{"$f":"CommercialBetterChoice!$G$40","v":0},{"$f":"CommercialBetterChoice!$I$40","v":0},{"$f":"CommercialBetterChoice!$K$40","v":0},{"$f":"CommercialBetterChoice!$E$41","v":0},{"$f":"CommercialBetterChoice!$G$41","v":0},{"$f":"CommercialBetterChoice!$I$41","v":0},{"$f":"CommercialBetterChoice!$K$41","v":0},{"$f":"CommercialBetterChoice!$E$44","v":0},{"$f":"CommercialBetterChoice!$G$44","v":0},{"$f":"CommercialBetterChoice!$I$44","v":0},{"$f":"CommercialBetterChoice!$K$44","v":0},{"$f":"CommercialBetterChoice!$E$45","v":0},{"$f":"CommercialBetterChoice!$G$45","v":0},{"$f":"CommercialBetterChoice!$I$45","v":0},{"$f":"CommercialBetterChoice!$K$45","v":0},{"$f":"CommercialBetterChoice!$E$46","v":0},{"$f":"CommercialBetterChoice!$G$46","v":0},{"$f":"CommercialBetterChoice!$I$46","v":0},{"$f":"CommercialBetterChoice!$K$46","v":0},{"$f":"CommercialBetterChoice!$E$49","v":0},{"$f":"CommercialBetterChoice!$G$49","v":0},{"$f":"CommercialBetterChoice!$I$49","v":0},{"$f":"CommercialBetterChoice!$K$49","v":0},{"$f":"CommercialBetterChoice!$E$55","v":0},{"$f":"CommercialBetterChoice!$K$55","v":0},{"$f":"CommercialBetterChoice!$K$56","v":0},{"$f":"CommercialBetterChoice!$K$57","v":0},{"$f":"CommercialBetterChoice!$K$58","v":0},{"$f":"CommercialBetterChoice!$I$11","v":0},{"$f":"CommercialBetterChoice!$I$12","v":0},{"$f":"CommercialBetterChoice!$E$33","v":0},{"$f":"CommercialBetterChoice!$K$33","v":0},{"$f":"CommercialBetterChoice!$E$47","v":0},{"$f":"CommercialBetterChoice!$G$47","v":0},{"$f":"CommercialBetterChoice!$I$47","v":0},{"$f":"CommercialBetterChoice!$K$47","v":0},{"$f":"CommercialBetterChoice!$P$47","v":0},{"$f":"CommercialBetterChoice!$E$50","v":0},{"$f":"CommercialBetterChoice!$G$50","v":0},{"$f":"CommercialBetterChoice!$I$50","v":0},{"$f":"CommercialBetterChoice!$K$50","v":0},{"$f":"CommercialBetterChoice!$E$51","v":0},{"$f":"CommercialBetterChoice!$G$51","v":0},{"$f":"CommercialBetterChoice!$I$51","v":0},{"$f":"CommercialBetterChoice!$K$51","v":0},{"$f":"CommercialBetterChoice!$E$52","v":0},{"$f":"CommercialBetterChoice!$G$52","v":0},{"$f":"CommercialBetterChoice!$I$52","v":0},{"$f":"CommercialBetterChoice!$K$52","v":0},{"$f":"CommercialBetterChoice!$P$52","v":0},{"$f":"CommercialBetterChoice!$E$66","v":0},{"$f":"CommercialBetterChoice!$G$66","v":0},{"$f":"CommercialBetterChoice!$I$66","v":0},{"$f":"CommercialBetterChoice!$K$66","v":0},{"$f":"CommercialBetterChoice!$P$66","v":0},{"$f":"CommercialBetterChoice!$E$67","v":0},{"$f":"CommercialBetterChoice!$G$67","v":0},{"$f":"CommercialBetterChoice!$I$67","v":0},{"$f":"CommercialBetterChoice!$K$67","v":0},{"$f":"CommercialBetterChoice!$E$69","v":0},{"$f":"CommercialBetterChoice!$G$69","v":0},{"$f":"CommercialBetterChoice!$I$69","v":0},{"$f":"CommercialBetterChoice!$K$69","v":0},{"$f":"CommercialBetterChoice!$P$69","v":0},{"$f":"CommercialBetterChoice!$P$70","v":0},{"$f":"CommercialBetterChoice!$P$71","v":0},{"$f":"CommercialBetterChoice!$P$72","v":0},{"$f":"CommercialBetterChoice!$P$73","v":0},{"$f":"BaselineAssessmentRate","v":5.5E-2},{"$f":"AssessmentLoading","v":2.5000000000000001E-2},{"$f":"CreditCardCommitments","v":3.8199999999999998E-2},{"$f":"WorkingsForNegativeGearing","v":3.2899999999999999E-2},{"$f":"OtherMortgageRepaymentBuffer","v":1.25},{"$f":"RentalIncomeShading","v":0.8},{"$f":"CompanyTax","v":0.25},{"$f":"CommercialBetterChoice!$E$81","v":0},{"$f":"CommercialBetterChoice!$I$81","v":0},{"$f":"CommercialBetterChoice!$I$82","v":0},{"$f":"CommercialBetterChoice!$I$85","v":0},{"$f":"CommercialBetterChoice!$I$86","v":0},{"$f":"CommercialBetterChoice!$K$85","v":"INCOMPLETE"},{"$f":"CommercialBetterChoice!$K$86","v":"INCOMPLETE"},{"$f":"CommercialBetterChoice!$I$89","v":"INCOMPLETE"}]

{"sheet":"TestCases","index":11,"n_rows":65,"n_cols":220,"rows_kept":65,"cut":false,"hidden":true,"merged":[[0,153,0,213],[0,0,0,91],[0,92,0,152]]}
["Test Cases TestCases TestCases TestCases TestCases TestCases TestCases TestCases TestCases TestCases TestCases TestCases TestCases TestCases TestCases TestCases TestCases TestCases TestCases TestCases TestCases TestCases TestCases TestCases TestCases TestCases TestCases TestCases TestCases  TestCases TestCases TestCases TestCases TestCases TestCases TestCases TestCases TestCases TestCases TestCases TestCases TestCases TestCases TestCases TestCases TestCases TestCases TestCases TestCases TestCases TestCases TestCases TestCases TestCases TestCases TestCases TestCases TestCases TestCases TestCases TestCases TestCases TestCases TestCases TestCases TestCases TestCases TestCases TestCases TestCases TestCases TestCases TestCases TestCases TestCases TestCases TestCases TestCases TestCases TestCases TestCases TestCases TestCases TestCases ",null,null,null,null,null,null,null,null,null,null,null,null,null,null,null,null,null,null,null,null,null,null,null,null,null,null,null,null,null,null,null,null,null,null,null,null,null,null,null,null,null,null,null,null,null,null,null,null,null,null,null,null,null,null,null,null,null,null,null,null,null,null,null,null,null,null,null,null,null,null,null,null,null,null,null,null,null,null,null,null,null,null,null,null,null,null,null,null,null,null,null,"Original-Result-set Original-Result-set Original-Result-set Original-Result-set Original-Result-set Original-Result-set Original-Result-set Original-Result-set Original-Result-set Original-Result-set Original-Result-set Original-Result-set Original-Result-set Original-Result-set Original-Result-set Original-Result-set Original-Result-set Original-Result-set Original-Result-set Original-Result-set Original-Result-set Original-Result-set Original-Result-set Original-Result-set Original-Result-set Original-Result-set Original-Result-set  Original-Result-set",null,null,null,null,null,null,null,null,null,null,null,null,null,null,null,null,null,null,null,null,null,null,null,null,null,null,null,null,null,null,null,null,null,null,null,null,null,null,null,null,null,null,null,null,null,null,null,null,null,null,null,null,null,null,null,null,null,null,null,null,"New-Resultset New-Resultset New-Resultset New-Resultset New-Resultset New-Resultset New-Resultset New-Resultset New-Resultset New-Resultset New-Resultset New-Resultset New-Resultset New-Resultset New-Resultset New-Resultset New-Resultset New-Resultset New-Resultset New-Resultset New-Resultset New-Resultset New-Resultset New-Resultset New-Resultset New-Resultset New-Resultset New-Resultset New-Resultset New-Resultset New-Resultset New-Resultset New-Resultset New-Resultset New-Resultset New-Resultset New-Resultset New-Resultset ",null,null,null,null,null,null,null,null,null,null,null,null,null,null,null,null,null,null,null,null,null,null,null,null,null,null,null,null,null,null,null,null,null,null,null,null,null,null,null,null,null,null,null,null,null,null,null,null,null,null,null,null,null,null,null,null,null,null,null,null,"Test cases will run when date tested is blank and Run Scenario Flag is \"Y\""]
["Total Loan Amount","WAVG Interest Rate","WAVG Assessment Rate","Max Loan Term","Max IO Term","Loan Amount 1","Interest Rate 1","Assessement Rate 1","Loan Term 1","IO Term 1","Loan Amount 2","Interest Rate 2","Assessment Rate 2","Loan Term 2","IO Term 2","Status 1","Status 2","Status 3","Status 4","Status 5","Status 6","Couple With 1","Couple With 2","Couple With 3","Couple With 4","Couple With 5","Couple With 6","Dependants 1","Dependants 2","Dependants 3","Dependants 4","Dependants 5","Dependants 6","Gross Annual Income 1","Gross Annual Income 2","Gross Annual Income 3","Gross Annual Income 4","Gross Annual Income 5","Gross Annual Income 6","Untaxed Income 1","Untaxed Income 2","Untaxed Income 3","Untaxed Income 4","Untaxed Income 5","Untaxed Income 6","SEIC 1","SEIC 2","SEIC 3","SEIC 4","SEIC 5","SEIC 6","Add Backs 1","Add Backs 2","Add Backs 3","Add Backs 4","Add Backs 5","Add Backs 6","NPBT 1","NPBT 2","NPBT 3","NPBT 4","NPBT 5","NPBT 6","Gross Rental Income 1","Gross Rental Income 2","Gross Rental Income 3","Gross Rental Income 4","Gross Rental Income 5","Gross Rental Income 6","Investment Property Loan Balance 1","Investment Property Loan Balance 2","Investment Property Loan Balance 3","Investment Property Loan Balance 4","Investment Property Loan Balance 5","Investment Property Loan Balance 6","Owner occupied property utilities, rates & costs","Investment property utilities, rates & costs","Rented property costs","Telephone, Internet, Pay TV & Media Streaming","Groceries","Recreation & Entertainment","Clothing & Personal Care","Medical & Health","Transport","Insurance","Other Living Expenses","Education","Childcare","Rent/Board","Total Credit Card Limit","Other Mortgage Repayments","Other Liabilities","Tax Applicant 1","Tax Applicant 2","Tax Applicant 3","Tax Applicant 4","Tax Applicant 5","Tax Applicant 6","Net Income Applicant 1","Net Income Applicant 2","Net Income Applicant 3","Net Income Applicant 4","Net Income Applicant 5","Net Income Applicant 6","Net Income Total","Hem Living Expense Applicant 1","Hem Living Expense Applicant 2","Hem Living Expense Applicant 3","Hem Living Expense Applicant 4","Hem Living Expense Applicant 5","Hem Living Expense Applicant 6","Hem Living Expense Total","Customer Nominated Living Expenses","Living Expense Used","Net Available Income","Baseline Assessment Rate","Assessment Loading","Credit Card Commitments","Workings for Negative Gearing","Other Mortgage Repayment Buffer","Rental Income Shading","Company Tax","Actual Rate Monthly Total Income","Actual Rate Monthly - Net Income","Actual Rate Monthly - Living Costs","Actual Rate Monthly - Net Available Income","Actual Rate Monthly - Proposed Repayments","Actual Rate Monthly - Other Commitments","Actual Rate Annually Total Income","Actual Rate Annually - Net Income","Actual Rate Annually - Living Costs","Actual Rate Annually - Net Available Income","Actual Rate Annually - Proposed Repayments","Actual Rate Annually - Other Commitments","Assessment Rate Monthly Total Income","Assessment Rate Monthly - Net Income","Assessment Rate Monthly - Living Costs","Assessment Rate Monthly - Net Available Income","Assessment Rate Monthly - Proposed Repayments","Assessment Rate Monthly - Other Commitments","Assessment Rate Annually Total Income","Assessment Rate Annually - Net Income","Assessment Rate Annually - Living Costs","Assessment Rate Annually - Net Available Income","Assessment Rate Annually - Proposed Repayments","Assessment Rate Annually - Other Commitments","Actual NSR","Actual DSR","Actual Results","Assessment NSR","Assessment DSR","Assessment Results","Allowable Income","Tax Applicant 1","Tax Applicant 2","Tax Applicant 3","Tax Applicant 4","Tax Applicant 5","Tax Applicant 6","Net Income Applicant 1","Net Income Applicant 2","Net Income Applicant 3","Net Income Applicant 4","Net Income Applicant 5","Net Income Applicant 6","Net Income Total","Hem Living Expense Applicant 1","Hem Living Expense Applicant 2","Hem Living Expense Applicant 3","Hem Living Expense Applicant 4","Hem Living Expense Applicant 5","Hem Living Expense Applicant 6","Hem Living Expense Total","Customer Nominated Living Expenses","Living Expense Used","Net Available Income","Baseline Assessment Rate","Assessment Loading","Credit Card Commitments","Workings for Negative Gearing","Other Mortgage Repayment Buffer","Rental Income Shading","Company Tax","Actual Rate Monthly Total Income","Actual Rate Monthly - Net Income","Actual Rate Monthly - Living Costs","Actual Rate Monthly - Net Available Income","Actual Rate Monthly - Proposed Repayments","Actual Rate Monthly - Other Commitments","Actual Rate Annually Total Income","Actual Rate Annually - Net Income","Actual Rate Annually - Living Costs","Actual Rate Annually - Net Available Income","Actual Rate Annually - Proposed Repayments","Actual Rate Annually - Other Commitments","Assessment Rate Monthly Total Income","Assessment Rate Monthly - Net Income","Assessment Rate Monthly - Living Costs","Assessment Rate Monthly - Net Available Income","Assessment Rate Monthly - Proposed Repayments","Assessment Rate Monthly - Other Commitments","Assessment Rate Annually Total Income","Assessment Rate Annually - Net Income","Assessment Rate Annually - Living Costs","Assessment Rate Annually - Net Available Income","Assessment Rate Annually - Proposed Repayments","Assessment Rate Annually - Other Commitments","Actual NSR","Actual DSR","Actual Results","Assessment NSR","Assessment DSR","Assessment Results","Allowable Income","Pass or Fail","Run Scenario Flag","Date Tested","Scenario","Sequence","Name "]
[1000000,0.06,8.4999999999999992E-2,30,5,1000000,0.06,8.4999999999999992E-2,30,5,null,null,null,null,null,"Individual (Couple)","Individual (Couple)",null,null,null,null,"Applicant 2","Applicant 1",null,null,null,null,2,null,null,null,null,null,270000,0,0,0,0,0,0,0,0,0,0,0,135000,0,0,0,0,0,0,0,0,0,0,0,100000,0,0,0,0,0,0,100000,0,0,0,0,0,300000,0,0,0,0,100,100,0,80,300,80,30,50,50,0,0,50,0,0,5000,1000,500,186017,14247.85,0,0,0,0,318983,66282.149999999994,0,0,0,0,385265.15,67456.14,0,0,0,0,0,67456.14,10080,67456.14,317809.01,5.5E-2,2.5000000000000001E-2,3.8199999999999998E-2,3.2899999999999999E-2,1.25,0.8,0.25,48750,32105.43,5621.34,26484.080000000002,6443.01,1941,585000,385265.15,67456.14,317809.01,77316.17,23292,48750,32105.43,5621.34,26484.080000000002,8052.27,1941,585000,385265.15,67456.14,317809.01,96627.25,23292,3.15,0.17197977466369405,"PASS",2.65,0.20499017096659103,"PASS",1000000,186017,14247.85,0,0,0,0,318983,66282.149999999994,0,0,0,0,385265.15,67456.14,0,0,0,0,0,67456.14,10080,67456.14,317809.01,5.5E-2,2.5000000000000001E-2,3.8199999999999998E-2,3.2899999999999999E-2,1.25,0.8,0.25,48750,32105.43,5621.34,26484.080000000002,6443.01,1941,585000,385265.15,67456.14,317809.01,77316.17,23292,48750,32105.43,5621.34,26484.080000000002,8052.27,1941,585000,385265.15,67456.14,317809.01,96627.25,23292,3.15,0.17197977466369405,"PASS",2.65,0.20499017096659103,"PASS",1000000,{"$f":"IF(AND(DS3=GB3,DT3=GC3,DU3=GD3,DV3=GE3,DW3=GF3,DX3=GG3,DY3=GH3,DZ3=GI3,EA3=GJ3,EB3=GK3,EC3=GL3,ED3=GM3,EE3=GN3,EF3=GO3,EG3=GP3,EH3=GQ3,EI3=GR3,EJ3=GS3,EK3=GT3,EL3=GU3,EM3=GV3,EN3=GW3,EO3=GX3,EP3=GY3,EQ3=GZ3,ER3=HA3,ES3=HB3,ET3=HC3,EU3=HD3,EV3=HE3,EW3=HF3),\"Pass\",\"Fail\")","v":"Pass"},"Y","2021-07-05T16:19:41",null,"Case 1","Emily"]
[1000000,0.06,8.4999999999999992E-2,25,0,1000000,0.06,8.4999999999999992E-2,25,0,null,null,null,null,null,"Individual (Couple)","Individual (Couple)",null,null,null,null,"Applicant 2","Applicant 1",null,null,null,null,2,null,null,null,null,null,260000,0,0,0,0,0,0,0,0,0,0,0,135000,0,0,0,0,0,0,0,0,0,0,0,0,0,0,0,0,0,0,100000,0,0,0,0,0,0,0,0,0,0,0,0,0,0,0,0,0,0,0,0,0,0,2000,0,5000,1000,500,156317,18067,0,0,0,0,238683,62463,0,0,0,0,301146,67456.14,0,0,0,0,0,67456.14,24000,67456.14,233689.86,5.5E-2,2.5000000000000001E-2,3.8199999999999998E-2,3.2899999999999999E-2,1.25,0.8,0.25,39583.33,25095.5,5621.34,19474.16,6443.01,1941,475000,301146,67456.14,233689.86,77316.17,23292,39583.33,25095.5,5621.34,19474.16,8052.27,1941,475000,301146,67456.14,233689.86,96627.25,23292,2.3199999999999998,0.21180666984897059,"PASS",1.94,0.25246157897990684,"PASS",1000000,156317,18067,0,0,0,0,238683,62463,0,0,0,0,301146,67456.14,0,0,0,0,0,67456.14,24000,67456.14,233689.86,5.5E-2,2.5000000000000001E-2,3.8199999999999998E-2,3.2899999999999999E-2,1.25,0.8,0.25,39583.33,25095.5,5621.34,19474.16,6443.01,1941,475000,301146,67456.14,233689.86,77316.17,23292,39583.33,25095.5,5621.34,19474.16,8052.27,1941,475000,301146,67456.14,233689.86,96627.25,23292,2.3199999999999998,0.21180666984897059,"PASS",1.94,0.25246157897990684,"PASS",1000000,"Pass","Y","2021-07-05T16:20:03",null,"Case 2","Emily"]
[1000000,0.04,6.5000000000000002E-2,31,0,1000000,0.04,6.5000000000000002E-2,31,0,null,null,null,null,null,"Individual (Couple)","Individual (Couple)",null,null,null,null,"Applicant 2","Applicant 1",null,null,null,null,2,null,null,null,null,null,260000,0,0,0,0,0,0,0,0,0,0,0,135000,0,0,0,0,0,0,0,0,0,0,0,0,0,0,0,0,0,0,100000,0,0,0,0,0,1000000,0,0,0,0,500,300,0,300,1200,1500,1200,500,400,500,0,500,0,0,5000,10000,500,156317,5677,0,0,0,0,238683,75065.5,0,0,0,0,313748.5,67456.14,0,0,0,0,0,67456.14,82800,82800,230948.5,5.5E-2,2.5000000000000001E-2,3.8199999999999998E-2,3.2899999999999999E-2,1.25,0.8,0.25,39583.33,26145.71,6900,19245.71,4694.71,13191,475000,313748.5,82800,230948.5,56336.57,158292,39583.33,26145.71,6900,19245.71,6255.15,13191,475000,313748.5,82800,230948.5,75061.84,158292,1.07,0.45184961197873053,"PASS",0.98,0.49127124017500845,"FAIL",967841.99,156317,5677,0,0,0,0,238683,75065.5,0,0,0,0,313748.5,67456.14,0,0,0,0,0,67456.14,82800,82800,230948.5,5.5E-2,2.5000000000000001E-2,3.8199999999999998E-2,3.2899999999999999E-2,1.25,0.8,0.25,39583.33,26145.71,6900,19245.71,4694.71,13191,475000,313748.5,82800,230948.5,56336.57,158292,39583.33,26145.71,6900,19245.71,6255.15,13191,475000,313748.5,82800,230948.5,75061.84,158292,1.07,0.45184961197873053,"PASS",0.98,0.49127124017500845,"FAIL",967841.99,"Pass","Y","2021-07-05T16:20:25",null,"Case 3","Emily"]
[2000000,0.05,7.5000000000000011E-2,25,1,2000000,0.05,7.5000000000000011E-2,25,1,null,null,null,null,null,"Individual (Single)","Individual (Couple)","Individual (Single)",null,null,null,null,"Non-loan Party",null,null,null,null,null,null,3,null,null,null,80000,100000,120000,0,0,0,0,0,0,0,0,0,0,0,0,0,0,0,0,0,0,0,0,0,0,0,0,0,0,0,0,0,0,0,0,0,0,0,0,0,0,0,0,0,0,0,0,0,0,0,0,0,0,0,0,0,0,0,0,18067,24967,31867,0,0,0,62463,75413,88213,0,0,0,226089,20169.12,35646.69,41729.660000000003,0,0,0,97545.46,0,97545.46,128543.54,5.5E-2,2.5000000000000001E-2,3.8199999999999998E-2,3.2899999999999999E-2,1.25,0.8,0.25,25000,18840.75,8128.79,10711.96,11937.95,0,300000,226089,97545.46,128543.54,143255.4,0,25000,18840.75,8128.79,10711.96,14992.1,0,300000,226089,97545.46,128543.54,179905.18,0,0.89,0.4775180097758896,"FAIL",0.71,0.59968392097038836,"FAIL",1428886.07,18067,24967,31867,0,0,0,62463,75413,88213,0,0,0,226089,20169.12,35646.69,41729.660000000003,0,0,0,97545.46,0,97545.46,128543.54,5.5E-2,2.5000000000000001E-2,3.8199999999999998E-2,3.2899999999999999E-2,1.25,0.8,0.25,25000,18840.75,8128.79,10711.96,11937.95,0,300000,226089,97545.46,128543.54,143255.4,0,25000,18840.75,8128.79,10711.96,14992.1,0,300000,226089,97545.46,128543.54,179905.18,0,0.89,0.4775180097758896,"FAIL",0.71,0.59968392097038836,"FAIL",1428886.07,"Pass","Y","2021-07-05T16:20:47",null,"Case 4","Emily"]
[1000000,0.04,6.5000000000000002E-2,25,0,1000000,0.04,6.5000000000000002E-2,25,0,null,null,null,null,null,"Individual (Single)","Individual (Single)","Individual (Single)","Individual (Single)","Individual (Single)","Individual (Single)",null,null,null,null,null,null,null,null,null,null,null,null,18200,22000,30000,40000,95000,190000,0,0,0,0,0,0,0,0,0,0,0,0,0,0,0,0,0,0,0,0,0,0,0,0,0,0,0,0,0,0,0,0,0,0,0,0,0,0,0,0,0,0,0,0,0,0,0,0,0,0,0,0,0,0,724,2842,4942,23242,59967,18200,21921,27803,35748,72213,130033,305918,13206.69,13921.82,13921.82,14607.63,23820.07,35608.97,115087.01,0,115087.01,190830.99,5.5E-2,2.5000000000000001E-2,3.8199999999999998E-2,3.2899999999999999E-2,1.25,0.8,0.25,32933.33,25493.17,9590.58,15902.58,5278.37,0,395200,305918,115087.01,190830.99,63340.42,0,32933.33,25493.17,9590.58,15902.58,6752.07,0,395200,305918,115087.01,190830.99,81024.86,0,3.01,0.16027434421997289,"PASS",2.35,0.20502241741325089,"PASS",1000000,0,724,2842,4942,23242,59967,18200,21921,27803,35748,72213,130033,305918,13206.69,13921.82,13921.82,14607.63,23820.07,35608.97,115087.01,0,115087.01,190830.99,5.5E-2,2.5000000000000001E-2,3.8199999999999998E-2,3.2899999999999999E-2,1.25,0.8,0.25,32933.33,25493.17,9590.58,15902.58,5278.37,0,395200,305918,115087.01,190830.99,63340.42,0,32933.33,25493.17,9590.58,15902.58,6752.07,0,395200,305918,115087.01,190830.99,81024.86,0,3.01,0.16027434421997289,"PASS",2.35,0.20502241741325089,"PASS",1000000,"Pass","Y","2021-07-05T16:21:08",null,"Case 5","Emily"]
[2500000,6.7900000000000002E-2,9.290000000000001E-2,40,5,2500000,6.7900000000000002E-2,9.290000000000001E-2,40,5,null,null,null,null,null,"Company","Individual (Single)","Individual (Couple)","Individual (Couple)","Individual (Couple)","Individual (Single)","","","Non-loan Party","Applicant 5","Applicant 4","","","","","","","",0,0,80000,30000,40000,1,0,0,0,0,0,0,0,150000,0,0,0,0,75000,0,0,0,0,0,535000,0,0,0,0,0,0,0,0,50000,50000,0,0,0,0,1000000,1000000,0,0,0,0,0,0,0,0,0,0,0,0,0,20000,0,50000,15000,0,133750,43567,18067,4333,6716.5,0,476250,106433,62463,66313.5,74080,1,785540.5,0,33308.36,31996.18,31996.18,0,13206.69,110507.41,240000,240000,545540.5,5.5E-2,2.5000000000000001E-2,3.8199999999999998E-2,3.2899999999999999E-2,1.25,0.8,0.25,82500.08,65461.71,20000,45461.71,15604.88,20660,990001,785540.5,240000,545540.5,187258.53,247920,82500.08,65461.71,20000,45461.71,20143.89,20660,990001,785540.5,240000,545540.5,241726.63,247920,1.25,0.43957383347021517,"PASS",1.1100000000000001,0.49459205719620725,"PASS",2500000,133750,43567,18067,4333,6716.5,0,476250,106433,62463,66313.5,74080,1,785540.5,0,33308.36,31996.18,31996.18,0,13206.69,110507.41,240000,240000,545540.5,5.5E-2,2.5000000000000001E-2,3.8199999999999998E-2,3.2899999999999999E-2,1.25,0.8,0.25,82500.08,65461.71,20000,45461.71,15604.88,20660,990001,785540.5,240000,545540.5,187258.53,247920,82500.08,65461.71,20000,45461.71,20143.89,20660,990001,785540.5,240000,545540.5,241726.63,247920,1.25,0.43957383347021517,"PASS",1.1100000000000001,0.49459205719620725,"PASS",2500000,"Pass","Y","2021-07-05T16:21:30",null,"Case 6","Emily"]
[2000000,5.2900000000000003E-2,7.7899999999999997E-2,30,3,2000000,5.2900000000000003E-2,7.7899999999999997E-2,30,3,null,null,null,null,null,"Company","Individual (Single)",null,null,null,null,null,null,null,null,null,null,null,null,null,null,null,null,0,1,0,0,0,0,0,30000,0,0,0,0,0,0,0,0,0,0,0,0,0,0,0,0,300000,0,0,0,0,0,0,0,0,0,0,0,0,0,0,0,0,0,0,0,0,0,0,0,0,0,0,0,0,0,0,0,0,0,0,75000,0,0,0,0,0,225000,30001,0,0,0,0,255001,0,13921.82,0,0,0,0,13921.82,0,13921.82,241079.18,5.5E-2,2.5000000000000001E-2,3.8199999999999998E-2,3.2899999999999999E-2,1.25,0.8,0.25,27500.080000000002,21250.080000000002,1160.1500000000001,20089.93,11608.05,0,330001,255001,13921.82,241079.18,139296.62,0,27500.080000000002,21250.080000000002,1160.1500000000001,20089.93,14802.32,0,330001,255001,13921.82,241079.18,177627.89,0,1.73,0.42210969960880051,"PASS",1.35,0.5382646950934924,"PASS",2000000,75000,0,0,0,0,0,225000,30001,0,0,0,0,255001,0,13921.82,0,0,0,0,13921.82,0,13921.82,241079.18,5.5E-2,2.5000000000000001E-2,3.8199999999999998E-2,3.2899999999999999E-2,1.25,0.8,0.25,27500.080000000002,21250.080000000002,1160.1500000000001,20089.93,11608.05,0,330001,255001,13921.82,241079.18,139296.62,0,27500.080000000002,21250.080000000002,1160.1500000000001,20089.93,14802.32,0,330001,255001,13921.82,241079.18,177627.89,0,1.73,0.42210969960880051,"PASS",1.35,0.5382646950934924,"PASS",2000000,"Pass","Y","2021-07-05T16:21:48",null,"Case 7","Emily"]
[350000,0.06,8.4999999999999992E-2,12,5,350000,0.06,8.4999999999999992E-2,12,5,null,null,null,null,null,"Individual (Couple)","Individual (Couple)","","","","","Applicant 2","Applicant 1","","","","",3,2,"","","","",100000,80000,0,0,0,0,0,1,0,0,0,0,0,25000,0,0,0,0,0,0,0,0,0,0,0,0,0,0,0,0,0,0,0,0,0,0,0,0,0,0,0,0,0,0,0,0,0,0,0,0,0,0,0,0,0,0,30000,500,0,24967,26692,0,0,0,0,75413,78614,0,0,0,0,154027,63314.23,0,0,0,0,0,63314.23,0,63314.23,90712.77,5.5E-2,2.5000000000000001E-2,3.8199999999999998E-2,3.2899999999999999E-2,1.25,0.8,0.25,17083.419999999998,12835.58,5276.19,7559.4,5112.99,1771,205001,154027,63314.23,90712.77,61355.93,21252,17083.419999999998,12835.58,5276.19,7559.4,5542.77,1771,205001,154027,63314.23,90712.77,66513.240000000005,21252,1.0900000000000001,0.40296354082116337,"PASS",1.03,0.42812102787786843,"PASS",350000,24967,26692,0,0,0,0,75413,78614,0,0,0,0,154027,63314.23,0,0,0,0,0,63314.23,0,63314.23,90712.77,5.5E-2,2.5000000000000001E-2,3.8199999999999998E-2,3.2899999999999999E-2,1.25,0.8,0.25,17083.419999999998,12835.58,5276.19,7559.4,5112.99,1771,205001,154027,63314.23,90712.77,61355.93,21252,17083.419999999998,12835.58,5276.19,7559.4,5542.77,1771,205001,154027,63314.23,90712.77,66513.240000000005,21252,1.0900000000000001,0.40296354082116337,"PASS",1.03,0.42812102787786843,"PASS",350000,"Pass","Y","2021-07-05T16:22:04",null,"Case 8","Emily"]
[350000,0.06,8.4999999999999992E-2,12,5,350000,0.06,8.4999999999999992E-2,12,5,null,null,null,null,null,"Individual (Couple)","Individual (Couple)","","","","","Applicant 2","Applicant 1","","","","",3,2,"","","","",100000,80000,0,0,0,0,0,0,0,0,0,0,0,25000,0,0,0,0,0,0,0,0,0,0,0,0,0,0,0,0,0,0,0,0,0,0,0,0,0,0,0,0,0,0,0,0,0,0,0,0,0,0,0,0,0,0,30000,500,0,24967,26692,0,0,0,0,75413,78613,0,0,0,0,154026,63314.23,0,0,0,0,0,63314.23,0,63314.23,90711.77,5.5E-2,2.5000000000000001E-2,3.8199999999999998E-2,3.2899999999999999E-2,1.25,0.8,0.25,17083.330000000002,12835.5,5276.19,7559.31,5112.99,1771,205000,154026,63314.23,90711.77,61355.93,21252,17083.330000000002,12835.5,5276.19,7559.31,5542.77,1771,205000,154026,63314.23,90711.77,66513.240000000005,21252,1.0900000000000001,0.40296550649697227,"PASS",1.03,0.42812311627312638,"PASS",350000,24967,26692,0,0,0,0,75413,78613,0,0,0,0,154026,63314.23,0,0,0,0,0,63314.23,0,63314.23,90711.77,5.5E-2,2.5000000000000001E-2,3.8199999999999998E-2,3.2899999999999999E-2,1.25,0.8,0.25,17083.330000000002,12835.5,5276.19,7559.31,5112.99,1771,205000,154026,63314.23,90711.77,61355.93,21252,17083.330000000002,12835.5,5276.19,7559.31,5542.77,1771,205000,154026,63314.23,90711.77,66513.240000000005,21252,1.0900000000000001,0.40296550649697227,"PASS",1.03,0.42812311627312638,"PASS",350000,"Pass","Y","2021-07-05T16:22:22",null,"Case 9","Emily"]
[500000,7.0000000000000007E-2,9.5000000000000001E-2,20,3,500000,7.0000000000000007E-2,9.5000000000000001E-2,20,3,null,null,null,null,null,"Individual (Couple)","Individual (Couple)",null,null,null,null,"Applicant 2","Applicant 1",null,null,null,null,2,null,null,null,null,null,150000,0,0,0,0,0,0,0,0,0,0,0,0,0,0,0,0,0,0,0,0,0,0,0,0,0,0,0,0,0,20000,0,0,0,0,0,0,0,0,0,0,0,4000,0,0,0,0,0,0,0,0,0,0,0,0,0,0,0,0,49807,0,0,0,0,0,116193,0,0,0,0,0,116193,51490.720000000001,0,0,0,0,0,51490.720000000001,48000,51490.720000000001,64702.28,5.5E-2,2.5000000000000001E-2,3.8199999999999998E-2,3.2899999999999999E-2,1.25,0.8,0.25,13833.33,9682.75,4290.8900000000003,5391.86,4198.3,0,166000,116193,51490.720000000001,64702.28,50379.64,0,13833.33,9682.75,4290.8900000000003,5391.86,4948.8999999999996,0,166000,116193,51490.720000000001,64702.28,59386.84,0,1.28,0.30349180227473499,"PASS",1.08,0.35775204060820864,"PASS",500000,49807,0,0,0,0,0,116193,0,0,0,0,0,116193,51490.720000000001,0,0,0,0,0,51490.720000000001,48000,51490.720000000001,64702.28,5.5E-2,2.5000000000000001E-2,3.8199999999999998E-2,3.2899999999999999E-2,1.25,0.8,0.25,13833.33,9682.75,4290.8900000000003,5391.86,4198.3,0,166000,116193,51490.720000000001,64702.28,50379.64,0,13833.33,9682.75,4290.8900000000003,5391.86,4948.8999999999996,0,166000,116193,51490.720000000001,64702.28,59386.84,0,1.28,0.30349180227473499,"PASS",1.08,0.35775204060820864,"PASS",500000,"Pass","Y","2021-07-05T16:22:39",null,"Case 10","Emily"]
[500000,7.0000000000000007E-2,9.5000000000000001E-2,20,3,500000,7.0000000000000007E-2,9.5000000000000001E-2,20,3,null,null,null,null,null,"Individual (Couple)","Individual (Couple)",null,null,null,null,"Applicant 2","Applicant 1",null,null,null,null,2,null,null,null,null,null,150000,0,0,0,0,0,0,0,0,0,0,0,0,0,0,0,0,0,0,0,0,0,0,0,0,0,0,0,0,0,20000,0,0,0,0,0,100000,0,0,0,0,0,4000,0,0,0,0,0,0,0,0,0,0,0,0,0,0,0,0,48523.9,0,0,0,0,0,117476.1,0,0,0,0,0,117476.1,51490.720000000001,0,0,0,0,0,51490.720000000001,48000,51490.720000000001,65985.38,5.5E-2,2.5000000000000001E-2,3.8199999999999998E-2,3.2899999999999999E-2,1.25,0.8,0.25,13833.33,9789.68,4290.8900000000003,5498.78,4198.3,0,166000,117476.1,51490.720000000001,65985.38,50379.64,0,13833.33,9789.68,4290.8900000000003,5498.78,4948.8999999999996,0,166000,117476.1,51490.720000000001,65985.38,59386.84,0,1.3,0.30349180227473499,"PASS",1.1100000000000001,0.35775204060820864,"PASS",500000,48523.9,0,0,0,0,0,117476.1,0,0,0,0,0,117476.1,51490.720000000001,0,0,0,0,0,51490.720000000001,48000,51490.720000000001,65985.38,5.5E-2,2.5000000000000001E-2,3.8199999999999998E-2,3.2899999999999999E-2,1.25,0.8,0.25,13833.33,9789.68,4290.8900000000003,5498.78,4198.3,0,166000,117476.1,51490.720000000001,65985.38,50379.64,0,13833.33,9789.68,4290.8900000000003,5498.78,4948.8999999999996,0,166000,117476.1,51490.720000000001,65985.38,59386.84,0,1.3,0.30349180227473499,"PASS",1.1100000000000001,0.35775204060820864,"PASS",500000,"Pass","Y","2021-07-05T16:22:55",null,"Case 11","Emily"]
[200000,0.05,7.5000000000000011E-2,30,0,200000,0.05,7.5000000000000011E-2,30,0,null,null,null,null,null,"Individual (Couple)","Individual (Couple)","","","","","Applicant 2","Applicant 1","","","","","","","","","","",0,10000,0,0,0,0,35000,0,0,0,0,0,0,0,0,0,0,0,0,0,0,0,0,0,0,0,0,0,0,0,0,0,0,0,0,0,0,0,0,0,0,0,100,0,0,0,0,0,0,0,0,0,0,0,0,0,0,0,0,0,0,0,0,0,0,35000,10000,0,0,0,0,45000,27489.02,0,0,0,0,0,27489.02,1200,27489.02,17510.98,5.5E-2,2.5000000000000001E-2,3.8199999999999998E-2,3.2899999999999999E-2,1.25,0.8,0.25,3750,3750,2290.75,1459.25,1073.6400000000001,0,45000,45000,27489.02,17510.98,12883.72,0,3750,3750,2290.75,1459.25,1398.43,0,45000,45000,27489.02,17510.98,16781.150000000001,0,1.35,0.28630486560647417,"PASS",1.04,0.37291440456148234,"FAIL",166901.57,0,0,0,0,0,0,35000,10000,0,0,0,0,45000,27489.02,0,0,0,0,0,27489.02,1200,27489.02,17510.98,5.5E-2,2.5000000000000001E-2,3.8199999999999998E-2,3.2899999999999999E-2,1.25,0.8,0.25,3750,3750,2290.75,1459.25,1073.6400000000001,0,45000,45000,27489.02,17510.98,12883.72,0,3750,3750,2290.75,1459.25,1398.43,0,45000,45000,27489.02,17510.98,16781.150000000001,0,1.35,0.28630486560647417,"PASS",1.04,0.37291440456148234,"FAIL",166901.57,"Pass","Y","2021-07-05T16:23:13",null,"Case 12","Emily"]
[1000000,0.05,7.5000000000000011E-2,30,0,1000000,0.05,7.5000000000000011E-2,30,0,null,null,null,null,null,"Individual (Couple)","Individual (Couple)","","","","","Applicant 2","Applicant 1","","","","","","","","","","",0,0,0,0,0,0,0,0,0,0,0,0,0,0,0,0,0,0,0,0,0,0,0,0,0,0,0,0,0,0,200000,0,0,0,0,0,1000000,0,0,0,0,0,100,0,0,0,0,0,0,0,0,0,0,0,0,0,0,0,0,34636,0,0,0,0,0,125364,0,0,0,0,0,125364,38951.31,0,0,0,0,0,38951.31,1200,38951.31,86412.69,5.5E-2,2.5000000000000001E-2,3.8199999999999998E-2,3.2899999999999999E-2,1.25,0.8,0.25,13333.33,10447,3245.94,7201.06,5368.22,0,160000,125364,38951.31,86412.69,64418.59,0,13333.33,10447,3245.94,7201.06,6992.15,0,160000,125364,38951.31,86412.69,83905.74,0,1.34,0.40261621725910429,"PASS",1.02,0.52441088141458436,"PASS",1000000,34636,0,0,0,0,0,125364,0,0,0,0,0,125364,38951.31,0,0,0,0,0,38951.31,1200,38951.31,86412.69,5.5E-2,2.5000000000000001E-2,3.8199999999999998E-2,3.2899999999999999E-2,1.25,0.8,0.25,13333.33,10447,3245.94,7201.06,5368.22,0,160000,125364,38951.31,86412.69,64418.59,0,13333.33,10447,3245.94,7201.06,6992.15,0,160000,125364,38951.31,86412.69,83905.74,0,1.34,0.40261621725910429,"PASS",1.02,0.52441088141458436,"PASS",1000000,"Pass","Y","2021-07-05T16:23:30",null,"Case 13","Emily"]
[1500000,0.06,8.4999999999999992E-2,30,0,1500000,0.06,8.4999999999999992E-2,30,0,null,null,null,null,null,"Individual (Couple)","Individual (Couple)","Individual (Single)","","","","Applicant 2","Applicant 1","","","","","","","","","","",300000,10000,0,0,0,0,35000,0,35000,0,0,0,116000,0,0,0,0,0,15000,0,0,0,0,0,0,0,0,0,0,0,0,0,0,0,0,0,0,0,0,0,0,0,100,0,0,0,0,0,0,0,0,0,0,0,0,0,0,0,0,166187,0,0,0,0,0,299813,10000,35000,0,0,0,344813,61314.12,0,14607.63,0,0,0,75921.75,1200,75921.75,268891.25,5.5E-2,2.5000000000000001E-2,3.8199999999999998E-2,3.2899999999999999E-2,1.25,0.8,0.25,42583.33,28734.42,6326.81,22407.599999999999,8993.26,0,511000,344813,75921.75,268891.25,107919.09,0,42583.33,28734.42,6326.81,22407.599999999999,11533.7,0,511000,344813,75921.75,268891.25,138404.43,0,2.4900000000000002,0.21119196580723176,"PASS",1.94,0.27085015077334645,"PASS",1500000,166187,0,0,0,0,0,299813,10000,35000,0,0,0,344813,61314.12,0,14607.63,0,0,0,75921.75,1200,75921.75,268891.25,5.5E-2,2.5000000000000001E-2,3.8199999999999998E-2,3.2899999999999999E-2,1.25,0.8,0.25,42583.33,28734.42,6326.81,22407.599999999999,8993.26,0,511000,344813,75921.75,268891.25,107919.09,0,42583.33,28734.42,6326.81,22407.599999999999,11533.7,0,511000,344813,75921.75,268891.25,138404.43,0,2.4900000000000002,0.21119196580723176,"PASS",1.94,0.27085015077334645,"PASS",1500000,"Pass","Y","2021-07-05T16:23:47",null,"Case 14","Emily"]
[1000000,0.06,8.4999999999999992E-2,30,0,1000000,0.06,8.4999999999999992E-2,30,0,null,null,null,null,null,"Individual (Single)","Individual (Couple)","Individual (Couple)","","","","","Applicant 3","Applicant 2","","","","","","","","","",0,50000,0,0,0,0,0,0,0,0,0,0,25000,0,0,0,0,0,0,0,0,0,0,0,0,0,0,0,0,0,0,60000,60000,0,0,0,0,500000,500000,0,0,0,1000,0,0,0,0,0,0,0,0,0,0,0,0,0,0,0,0,1594,18601.75,3167.5,0,0,0,24051,79928.25,45477.5,0,0,0,149456.75,13921.82,38951.31,0,0,0,0,52873.14,12000,52873.14,96583.61,5.5E-2,2.5000000000000001E-2,3.8199999999999998E-2,3.2899999999999999E-2,1.25,0.8,0.25,14250,12454.73,4406.09,8048.63,5995.51,0,171000,149456.75,52873.14,96583.61,71946.06,0,14250,12454.73,4406.09,8048.63,7689.13,0,171000,149456.75,52873.14,96583.61,92269.62,0,1.34,0.42073721063351038,"PASS",1.04,0.53958840953286569,"PASS",1000000,1594,18601.75,3167.5,0,0,0,24051,79928.25,45477.5,0,0,0,149456.75,13921.82,38951.31,0,0,0,0,52873.14,12000,52873.14,96583.61,5.5E-2,2.5000000000000001E-2,3.8199999999999998E-2,3.2899999999999999E-2,1.25,0.8,0.25,14250,12454.73,4406.09,8048.63,5995.51,0,171000,149456.75,52873.14,96583.61,71946.06,0,14250,12454.73,4406.09,8048.63,7689.13,0,171000,149456.75,52873.14,96583.61,92269.62,0,1.34,0.42073721063351038,"PASS",1.04,0.53958840953286569,"PASS",1000000,"Pass","Y","2021-07-05T16:24:03",null,"Case 15","Emily"]
[200000,0.05,7.5000000000000011E-2,30,0,200000,0.05,7.5000000000000011E-2,30,0,null,null,null,null,null,"Individual (Single)","","","","","","","","","","","",1,"","","","","",107000,0,0,0,0,0,0,0,0,0,0,0,0,0,0,0,0,0,0,0,0,0,0,0,0,0,0,0,0,0,0,0,0,0,0,0,0,0,0,0,0,0,100,0,0,0,0,0,0,0,0,0,0,0,0,0,10000,1000,1000,27382,0,0,0,0,0,79893,0,0,0,0,0,79893,31806.81,0,0,0,0,0,31806.81,1200,31806.81,48086.19,5.5E-2,2.5000000000000001E-2,3.8199999999999998E-2,3.2899999999999999E-2,1.25,0.8,0.25,8916.67,6657.75,2650.57,4007.18,1073.6400000000001,2632,107000,79893,31806.81,48086.19,12883.72,31584,8916.67,6657.75,2650.57,4007.18,1398.43,2632,107000,79893,31806.81,48086.19,16781.150000000001,31584,1.08,0.41558615843262936,"PASS",0.99,0.45201073089034305,"FAIL",196649.24,27382,0,0,0,0,0,79893,0,0,0,0,0,79893,31806.81,0,0,0,0,0,31806.81,1200,31806.81,48086.19,5.5E-2,2.5000000000000001E-2,3.8199999999999998E-2,3.2899999999999999E-2,1.25,0.8,0.25,8916.67,6657.75,2650.57,4007.18,1073.6400000000001,2632,107000,79893,31806.81,48086.19,12883.72,31584,8916.67,6657.75,2650.57,4007.18,1398.43,2632,107000,79893,31806.81,48086.19,16781.150000000001,31584,1.08,0.41558615843262936,"PASS",0.99,0.45201073089034305,"FAIL",196649.24,"Pass","Y","2021-07-05T16:24:22",null,"Case 16","Emily"]
[200000,0.05,7.5000000000000011E-2,30,0,200000,0.05,7.5000000000000011E-2,30,0,null,null,null,null,null,"Individual (Single)","","","","","","","","","","","",1,"","","","","",107000,0,0,0,0,0,25000,0,0,0,0,0,0,0,0,0,0,0,0,0,0,0,0,0,0,0,0,0,0,0,0,0,0,0,0,0,0,0,0,0,0,0,100,0,0,0,0,0,0,0,0,0,0,0,0,0,10000,1000,1000,27382,0,0,0,0,0,104893,0,0,0,0,0,104893,36071.480000000003,0,0,0,0,0,36071.480000000003,1200,36071.480000000003,68821.52,5.5E-2,2.5000000000000001E-2,3.8199999999999998E-2,3.2899999999999999E-2,1.25,0.8,0.25,11000,8741.08,3005.96,5735.13,1073.6400000000001,2632,132000,104893,36071.480000000003,68821.52,12883.72,31584,11000,8741.08,3005.96,5735.13,1398.43,2632,132000,104893,36071.480000000003,68821.52,16781.150000000001,31584,1.54,0.33687665872947986,"PASS",1.42,0.36640263791868716,"PASS",200000,27382,0,0,0,0,0,104893,0,0,0,0,0,104893,36071.480000000003,0,0,0,0,0,36071.480000000003,1200,36071.480000000003,68821.52,5.5E-2,2.5000000000000001E-2,3.8199999999999998E-2,3.2899999999999999E-2,1.25,0.8,0.25,11000,8741.08,3005.96,5735.13,1073.6400000000001,2632,132000,104893,36071.480000000003,68821.52,12883.72,31584,11000,8741.08,3005.96,5735.13,1398.43,2632,132000,104893,36071.480000000003,68821.52,16781.150000000001,31584,1.54,0.33687665872947986,"PASS",1.42,0.36640263791868716,"PASS",200000,"Pass","Y","2021-07-05T16:24:41",null,"Case 17","Emily"]
[2500000,6.7900000000000002E-2,9.290000000000001E-2,40,5,2500000,6.7900000000000002E-2,9.290000000000001E-2,40,5,null,null,null,null,null,"Company","Individual (Single)","Individual (Couple)","Individual (Couple)","Individual (Couple)","Individual (Single)",null,null,"Non-loan Party","Applicant 5","Applicant 4",null,null,null,null,null,null,null,0,0,80000,0,0,300000,0,0,0,0,0,0,535000,150000,0,0,0,0,75000,0,0,0,0,0,0,0,0,0,0,0,0,0,0,50000,50000,0,0,0,0,1000000,1000000,0,0,0,0,0,0,0,0,0,0,0,0,0,20000,0,50000,15000,0,133750,43567,18067,0,0,111667,476250,106433,62463,40000,40000,188333,913479,0,33308.36,31996.18,25749.66,0,47297.52,138351.72,240000,240000,673479,5.5E-2,2.5000000000000001E-2,3.8199999999999998E-2,3.2899999999999999E-2,1.25,0.8,0.25,101666.67,76123.25,20000,56123.25,15604.88,20660,1220000,913479,240000,673479,187258.53,247920,101666.67,76123.25,20000,56123.25,20143.89,20660,1220000,913479,240000,673479,241726.63,247920,1.54,0.35670371697487419,"PASS",1.37,0.40134969771828066,"PASS",2500000,133750,43567,18067,0,0,111667,476250,106433,62463,40000,40000,188333,913479,0,33308.36,31996.18,25749.66,0,47297.52,138351.72,240000,240000,673479,5.5E-2,2.5000000000000001E-2,3.8199999999999998E-2,3.2899999999999999E-2,1.25,0.8,0.25,101666.67,76123.25,20000,56123.25,15604.88,20660,1220000,913479,240000,673479,187258.53,247920,101666.67,76123.25,20000,56123.25,20143.89,20660,1220000,913479,240000,673479,241726.63,247920,1.54,0.35670371697487419,"PASS",1.37,0.40134969771828066,"PASS",2500000,"Pass","Y","2021-07-05T16:24:59",null,"Case 18","Emily"]
[2500000,6.7900000000000002E-2,9.290000000000001E-2,40,5,2500000,6.7900000000000002E-2,9.290000000000001E-2,40,5,null,null,null,null,null,"Company","Individual (Single)","Individual (Couple)","Individual (Couple)","Individual (Couple)","Individual (Single)","","","Non-loan Party","Applicant 5","Applicant 4","","","","","","","",0,0,80000,30000,40000,0,0,0,0,0,0,75000,0,150000,0,0,0,0,75000,0,0,0,0,0,535000,0,0,0,0,0,0,0,0,50000,50000,0,0,0,0,1000000,1000000,0,0,0,0,0,0,0,0,0,0,0,0,0,20000,0,50000,15000,0,133750,43567,18067,4333,6716.5,0,476250,106433,62463,66313.5,74080,75000,860539.5,0,33308.36,31996.18,31996.18,0,20169.12,117469.83,240000,240000,620539.5,5.5E-2,2.5000000000000001E-2,3.8199999999999998E-2,3.2899999999999999E-2,1.25,0.8,0.25,88750,71711.63,20000,51711.63,15604.88,20660,1065000,860539.5,240000,620539.5,187258.53,247920,88750,71711.63,20000,51711.63,20143.89,20660,1065000,860539.5,240000,620539.5,241726.63,247920,1.42,0.4086183424500906,"PASS",1.26,0.45976209503878157,"PASS",2500000,133750,43567,18067,4333,6716.5,0,476250,106433,62463,66313.5,74080,75000,860539.5,0,33308.36,31996.18,31996.18,0,20169.12,117469.83,240000,240000,620539.5,5.5E-2,2.5000000000000001E-2,3.8199999999999998E-2,3.2899999999999999E-2,1.25,0.8,0.25,88750,71711.63,20000,51711.63,15604.88,20660,1065000,860539.5,240000,620539.5,187258.53,247920,88750,71711.63,20000,51711.63,20143.89,20660,1065000,860539.5,240000,620539.5,241726.63,247920,1.42,0.4086183424500906,"PASS",1.26,0.45976209503878157,"PASS",2500000,"Pass","Y","2021-07-05T16:25:21",null,"Case 19","Emily"]
[2500000,6.7900000000000002E-2,9.290000000000001E-2,40,5,2500000,6.7900000000000002E-2,9.290000000000001E-2,40,5,null,null,null,null,null,"Company","Individual (Single)","Individual (Couple)","Individual (Couple)","Individual (Couple)","Individual (Single)",null,null,"Non-loan Party","Applicant 5","Applicant 4",null,null,null,null,null,null,null,0,0,80000,30000,40000,0,0,0,0,0,0,75000,535000,150000,0,0,0,0,75000,0,0,0,0,0,0,0,0,0,0,0,0,0,0,50000,50000,0,0,0,0,1000000,1000000,0,0,0,0,0,0,0,0,0,0,0,0,0,20000,0,50000,15000,0,133750,43567,18067,4333,6716.5,0,476250,106433,62463,66313.5,74080,75000,860539.5,0,33308.36,31996.18,31996.18,0,20169.12,117469.83,240000,240000,620539.5,5.5E-2,2.5000000000000001E-2,3.8199999999999998E-2,3.2899999999999999E-2,1.25,0.8,0.25,88750,71711.63,20000,51711.63,15604.88,20660,1065000,860539.5,240000,620539.5,187258.53,247920,88750,71711.63,20000,51711.63,20143.89,20660,1065000,860539.5,240000,620539.5,241726.63,247920,1.42,0.4086183424500906,"PASS",1.26,0.45976209503878157,"PASS",2500000,133750,43567,18067,4333,6716.5,0,476250,106433,62463,66313.5,74080,75000,860539.5,0,33308.36,31996.18,31996.18,0,20169.12,117469.83,240000,240000,620539.5,5.5E-2,2.5000000000000001E-2,3.8199999999999998E-2,3.2899999999999999E-2,1.25,0.8,0.25,88750,71711.63,20000,51711.63,15604.88,20660,1065000,860539.5,240000,620539.5,187258.53,247920,88750,71711.63,20000,51711.63,20143.89,20660,1065000,860539.5,240000,620539.5,241726.63,247920,1.42,0.4086183424500906,"PASS",1.26,0.45976209503878157,"PASS",2500000,"Pass","Y","2021-07-05T16:25:42",null,"Case 20","Emily"]
[2500000,6.7900000000000002E-2,9.290000000000001E-2,40,5,2500000,6.7900000000000002E-2,9.290000000000001E-2,40,5,null,null,null,null,null,"Company","Individual (Single)","Individual (Couple)","Individual (Couple)","Individual (Couple)","Individual (Single)",null,null,"Non-loan Party","Applicant 5","Applicant 4",null,null,null,null,null,null,null,0,0,80000,30000,40000,0,0,0,0,0,0,409501,535000,150000,0,0,0,0,75000,0,0,0,0,0,0,0,0,0,0,0,0,0,0,50000,50000,0,0,0,0,1000000,1000000,0,0,0,0,0,0,0,0,0,0,0,0,0,20000,0,50000,15000,0,133750,43567,18067,4333,6716.5,0,476250,106433,62463,66313.5,74080,409501,1195040.5,0,33308.36,31996.18,31996.18,0,49490.67,146791.39000000001,240000,240000,955040.5,5.5E-2,2.5000000000000001E-2,3.8199999999999998E-2,3.2899999999999999E-2,1.25,0.8,0.25,116625.08,99586.71,20000,79586.710000000006,15604.88,20660,1399501,1195040.5,240000,955040.5,187258.53,247920,116625.08,99586.71,20000,79586.710000000006,20143.89,20660,1399501,1195040.5,240000,955040.5,241726.63,247920,2.19,0.31095264291297148,"PASS",1.95,0.3498722982093635,"PASS",2500000,133750,43567,18067,4333,6716.5,0,476250,106433,62463,66313.5,74080,409501,1195040.5,0,33308.36,31996.18,31996.18,0,49490.67,146791.39000000001,240000,240000,955040.5,5.5E-2,2.5000000000000001E-2,3.8199999999999998E-2,3.2899999999999999E-2,1.25,0.8,0.25,116625.08,99586.71,20000,79586.710000000006,15604.88,20660,1399501,1195040.5,240000,955040.5,187258.53,247920,116625.08,99586.71,20000,79586.710000000006,20143.89,20660,1399501,1195040.5,240000,955040.5,241726.63,247920,2.19,0.31095264291297148,"PASS",1.95,0.3498722982093635,"PASS",2500000,"Pass","Y","2021-07-05T16:26:01",null,"Case 21","Emily"]
[2500000,6.7900000000000002E-2,9.290000000000001E-2,40,5,2500000,6.7900000000000002E-2,9.290000000000001E-2,40,5,null,null,null,null,null,"Company","Individual (Single)","Individual (Couple)","Individual (Couple)","Individual (Couple)","Individual (Single)",null,null,"Non-loan Party","Applicant 5","Applicant 4",null,null,null,null,null,null,null,0,0,80000,30000,40000,1,0,0,0,0,0,0,535000,150000,0,0,0,0,75000,0,0,0,0,0,0,0,0,0,0,0,0,0,0,50000,50000,0,0,0,0,1000000,1000000,0,0,0,0,0,0,0,0,0,0,0,0,0,20000,0,50000,15000,0,133750,43567,18067,4333,6716.5,0,476250,106433,62463,66313.5,74080,1,785540.5,0,33308.36,31996.18,31996.18,0,13206.69,110507.41,240000,240000,545540.5,5.5E-2,2.5000000000000001E-2,3.8199999999999998E-2,3.2899999999999999E-2,1.25,0.8,0.25,82500.08,65461.71,20000,45461.71,15604.88,20660,990001,785540.5,240000,545540.5,187258.53,247920,82500.08,65461.71,20000,45461.71,20143.89,20660,990001,785540.5,240000,545540.5,241726.63,247920,1.25,0.43957383347021517,"PASS",1.1100000000000001,0.49459205719620725,"PASS",2500000,133750,43567,18067,4333,6716.5,0,476250,106433,62463,66313.5,74080,1,785540.5,0,33308.36,31996.18,31996.18,0,13206.69,110507.41,240000,240000,545540.5,5.5E-2,2.5000000000000001E-2,3.8199999999999998E-2,3.2899999999999999E-2,1.25,0.8,0.25,82500.08,65461.71,20000,45461.71,15604.88,20660,990001,785540.5,240000,545540.5,187258.53,247920,82500.08,65461.71,20000,45461.71,20143.89,20660,990001,785540.5,240000,545540.5,241726.63,247920,1.25,0.43957383347021517,"PASS",1.1100000000000001,0.49459205719620725,"PASS",2500000,"Pass","Y","2021-07-05T16:26:21",null,"Case 22","Emily"]
[2500000,6.7900000000000002E-2,9.290000000000001E-2,40,5,2500000,6.7900000000000002E-2,9.290000000000001E-2,40,5,null,null,null,null,null,"Company","Individual (Single)","Individual (Couple)","Individual (Couple)","Individual (Couple)","Individual (Single)","","","Non-loan Party","Applicant 5","Applicant 4","","","","","","","",0,0,80000,30000,40000,1,0,0,0,0,0,500000,0,1,0,0,0,0,75000,0,0,0,0,0,35000,0,0,0,0,0,0,0,0,50000,50000,0,0,0,0,1000000,1000000,0,0,0,0,0,0,0,0,0,0,0,0,0,20000,0,50000,15000,0,8750,0,18067,4333,6716.5,0,101250,1,62463,66313.5,74080,500001,804108.5,0,13206.69,31996.18,31996.18,0,49490.67,126689.72,240000,240000,564108.5,5.5E-2,2.5000000000000001E-2,3.8199999999999998E-2,3.2899999999999999E-2,1.25,0.8,0.25,70000.17,67009.039999999994,20000,47009.04,15604.88,20660,840002,804108.5,240000,564108.5,187258.53,247920,70000.17,67009.039999999994,20000,47009.04,20143.89,20660,840002,804108.5,240000,564108.5,241726.63,247920,1.29,0.51806845068148233,"PASS",1.1499999999999999,0.58291126832591156,"FAIL",2103243.64,8750,0,18067,4333,6716.5,0,101250,1,62463,66313.5,74080,500001,804108.5,0,13206.69,31996.18,31996.18,0,49490.67,126689.72,240000,240000,564108.5,5.5E-2,2.5000000000000001E-2,3.8199999999999998E-2,3.2899999999999999E-2,1.25,0.8,0.25,70000.17,67009.039999999994,20000,47009.04,15604.88,20660,840002,804108.5,240000,564108.5,187258.53,247920,70000.17,67009.039999999994,20000,47009.04,20143.89,20660,840002,804108.5,240000,564108.5,241726.63,247920,1.29,0.51806845068148233,"PASS",1.1499999999999999,0.58291126832591156,"FAIL",2103243.64,"Pass","Y","2021-07-05T16:26:42",null,"Case 23","Emily"]
[2000000,5.2900000000000003E-2,7.7899999999999997E-2,30,3,2000000,5.2900000000000003E-2,7.7899999999999997E-2,30,3,null,null,null,null,null,"Company","Individual (Single)","","","","","","","","","","","","","","","","",0,0,0,0,0,0,0,30000,0,0,0,0,0,0,0,0,0,0,0,0,0,0,0,0,300000,0,0,0,0,0,0,0,0,0,0,0,0,0,0,0,0,0,0,0,0,0,0,0,0,0,0,0,0,0,0,0,0,0,0,75000,0,0,0,0,0,225000,30000,0,0,0,0,255000,0,13921.82,0,0,0,0,13921.82,0,13921.82,241078.18,5.5E-2,2.5000000000000001E-2,3.8199999999999998E-2,3.2899999999999999E-2,1.25,0.8,0.25,27500,21250,1160.1500000000001,20089.849999999999,11608.05,0,330000,255000,13921.82,241078.18,139296.62,0,27500,21250,1160.1500000000001,20089.849999999999,14802.32,0,330000,255000,13921.82,241078.18,177627.89,0,1.73,0.42211097872910236,"PASS",1.35,0.53826632619862913,"PASS",2000000,75000,0,0,0,0,0,225000,30000,0,0,0,0,255000,0,13921.82,0,0,0,0,13921.82,0,13921.82,241078.18,5.5E-2,2.5000000000000001E-2,3.8199999999999998E-2,3.2899999999999999E-2,1.25,0.8,0.25,27500,21250,1160.1500000000001,20089.849999999999,11608.05,0,330000,255000,13921.82,241078.18,139296.62,0,27500,21250,1160.1500000000001,20089.849999999999,14802.32,0,330000,255000,13921.82,241078.18,177627.89,0,1.73,0.42211097872910236,"PASS",1.35,0.53826632619862913,"PASS",2000000,"Pass","Y","2021-07-05T16:27:03",null,"Case 24","Emily"]
[2000000,5.2900000000000003E-2,7.7899999999999997E-2,30,3,2000000,5.2900000000000003E-2,7.7899999999999997E-2,30,3,null,null,null,null,null,"Individual (Single)","Individual (Single)","","","","","","","","","","","","","","","","",0,1,0,0,0,0,0,30000,0,0,0,0,330000,0,0,0,0,0,0,0,0,0,0,0,0,0,0,0,0,0,0,0,0,0,0,0,0,0,0,0,0,0,0,0,0,0,0,0,0,0,0,0,0,0,0,0,0,0,0,125767,0,0,0,0,0,204233,30001,0,0,0,0,234234,49490.67,13921.82,0,0,0,0,63412.5,0,63412.5,170821.5,5.5E-2,2.5000000000000001E-2,3.8199999999999998E-2,3.2899999999999999E-2,1.25,0.8,0.25,30000.080000000002,19519.5,5284.37,14235.13,11608.05,0,360001,234234,63412.5,170821.5,139296.62,0,30000.080000000002,19519.5,5284.37,14235.13,14802.32,0,360001,234234,63412.5,170821.5,177627.89,0,1.22,0.38693398901837434,"PASS",0.96,0.49340942843366437,"FAIL",1923346.64,125767,0,0,0,0,0,204233,30001,0,0,0,0,234234,49490.67,13921.82,0,0,0,0,63412.5,0,63412.5,170821.5,5.5E-2,2.5000000000000001E-2,3.8199999999999998E-2,3.2899999999999999E-2,1.25,0.8,0.25,30000.080000000002,19519.5,5284.37,14235.13,11608.05,0,360001,234234,63412.5,170821.5,139296.62,0,30000.080000000002,19519.5,5284.37,14235.13,14802.32,0,360001,234234,63412.5,170821.5,177627.89,0,1.22,0.38693398901837434,"PASS",0.96,0.49340942843366437,"FAIL",1923346.64,{"$f":"IF(AND(DS27=GB27,DT27=GC27,DU27=GD27,DV27=GE27,DW27=GF27,DX27=GG27,DY27=GH27,DZ27=GI27,EA27=GJ27,EB27=GK27,EC27=GL27,ED27=GM27,EE27=GN27,EF27=GO27,EG27=GP27,EH27=GQ27,EI27=GR27,EJ27=GS27,EK27=GT27,EL27=GU27,EM27=GV27,EN27=GW27,EO27=GX27,EP27=GY27,EQ27=GZ27,ER27=HA27,ES27=HB27,ET27=HC27,EU27=HD27,EV27=HE27,EW27=HF27),\"Pass\",\"Fail\")","v":"Pass"},"Y","2021-07-05T16:27:22",null,"Case 25","Emily"]
[1500000,0.06,8.4999999999999992E-2,30,0,1500000,0.06,8.4999999999999992E-2,30,0,null,null,null,null,null,"Individual (Couple)","Individual (Couple)","Individual (Single)","Individual (Single)",null,null,"Applicant 2","Applicant 1",null,null,null,null,null,null,null,null,null,null,36000,10000,0,0,0,0,35000,0,35000,100000,0,0,0,0,0,0,0,0,10000,0,0,0,0,0,0,0,0,0,0,0,0,0,0,0,0,0,0,0,0,0,0,0,100,0,0,0,0,0,0,0,0,0,0,0,0,0,0,0,0,4102,0,0,0,0,0,77543,10000,35000,100000,0,0,222543,35646.69,0,14607.63,23820.07,0,0,74074.39,1200,74074.39,148468.60999999999,5.5E-2,2.5000000000000001E-2,3.8199999999999998E-2,3.2899999999999999E-2,1.25,0.8,0.25,18833.330000000002,18545.25,6172.87,12372.38,8993.26,0,226000,222543,74074.39,148468.60999999999,107919.09,0,18833.330000000002,18545.25,6172.87,12372.38,11533.7,0,226000,222543,74074.39,148468.60999999999,138404.43,0,1.37,0.47751811737829836,"PASS",1.07,0.61240896922646026,"FAIL",1287140.9099999999,4102,0,0,0,0,0,77543,10000,35000,100000,0,0,222543,35646.69,0,14607.63,23820.07,0,0,74074.39,1200,74074.39,148468.60999999999,5.5E-2,2.5000000000000001E-2,3.8199999999999998E-2,3.2899999999999999E-2,1.25,0.8,0.25,18833.330000000002,18545.25,6172.87,12372.38,8993.26,0,226000,222543,74074.39,148468.60999999999,107919.09,0,18833.330000000002,18545.25,6172.87,12372.38,11533.7,0,226000,222543,74074.39,148468.60999999999,138404.43,0,1.37,0.47751811737829836,"PASS",1.07,0.61240896922646026,"FAIL",1287140.9099999999,"Pass","Y","2021-07-05T16:27:43",null,"Case 26","Emily"]
[1000000,0.06,8.4999999999999992E-2,30,0,1000000,0.06,8.4999999999999992E-2,30,0,null,null,null,null,null,"Individual (Single)","Individual (Couple)","Individual (Couple)",null,null,null,null,"Applicant 3","Applicant 2",null,null,null,null,null,null,null,null,null,0,50000,0,0,0,0,0,0,0,0,0,0,25000,0,0,0,0,0,0,0,0,0,0,0,0,0,0,0,0,0,0,60000,60000,0,0,0,0,500000,500000,0,0,0,100,0,0,0,0,0,0,0,0,0,0,0,0,0,0,0,0,1594,18601.75,3167.5,0,0,0,24051,79928.25,45477.5,0,0,0,149456.75,13921.82,38951.31,0,0,0,0,52873.14,1200,52873.14,96583.61,5.5E-2,2.5000000000000001E-2,3.8199999999999998E-2,3.2899999999999999E-2,1.25,0.8,0.25,14250,12454.73,4406.09,8048.63,5995.51,0,171000,149456.75,52873.14,96583.61,71946.06,0,14250,12454.73,4406.09,8048.63,7689.13,0,171000,149456.75,52873.14,96583.61,92269.62,0,1.34,0.42073721063351038,"PASS",1.04,0.53958840953286569,"PASS",1000000,1594,18601.75,3167.5,0,0,0,24051,79928.25,45477.5,0,0,0,149456.75,13921.82,38951.31,0,0,0,0,52873.14,1200,52873.14,96583.61,5.5E-2,2.5000000000000001E-2,3.8199999999999998E-2,3.2899999999999999E-2,1.25,0.8,0.25,14250,12454.73,4406.09,8048.63,5995.51,0,171000,149456.75,52873.14,96583.61,71946.06,0,14250,12454.73,4406.09,8048.63,7689.13,0,171000,149456.75,52873.14,96583.61,92269.62,0,1.34,0.42073721063351038,"PASS",1.04,0.53958840953286569,"PASS",1000000,{"$f":"IF(AND(DS29=GB29,DT29=GC29,DU29=GD29,DV29=GE29,DW29=GF29,DX29=GG29,DY29=GH29,DZ29=GI29,EA29=GJ29,EB29=GK29,EC29=GL29,ED29=GM29,EE29=GN29,EF29=GO29,EG29=GP29,EH29=GQ29,EI29=GR29,EJ29=GS29,EK29=GT29,EL29=GU29,EM29=GV29,EN29=GW29,EO29=GX29,EP29=GY29,EQ29=GZ29,ER29=HA29,ES29=HB29,ET29=HC29,EU29=HD29,EV29=HE29,EW29=HF29),\"Pass\",\"Fail\")","v":"Pass"},"Y","2021-07-05T16:28:02",null,"Case 27","Emily"]
[1000000,0.05,7.5000000000000011E-2,30,0,1000000,0.05,7.5000000000000011E-2,30,0,null,null,null,null,null,"Individual (Couple)","Individual (Couple)",null,null,null,null,"Applicant 2","Applicant 1",null,null,null,null,null,null,null,null,null,null,0,0,0,0,0,0,0,0,0,0,0,0,0,0,0,0,0,0,0,0,0,0,0,0,0,0,0,0,0,0,200000,0,0,0,0,0,1000000,0,0,0,0,0,100,0,0,0,0,0,0,0,0,0,0,0,0,0,0,0,0,34636,0,0,0,0,0,125364,0,0,0,0,0,125364,38951.31,0,0,0,0,0,38951.31,1200,38951.31,86412.69,5.5E-2,2.5000000000000001E-2,3.8199999999999998E-2,3.2899999999999999E-2,1.25,0.8,0.25,13333.33,10447,3245.94,7201.06,5368.22,0,160000,125364,38951.31,86412.69,64418.59,0,13333.33,10447,3245.94,7201.06,6992.15,0,160000,125364,38951.31,86412.69,83905.74,0,1.34,0.40261621725910429,"PASS",1.02,0.52441088141458436,"PASS",1000000,34636,0,0,0,0,0,125364,0,0,0,0,0,125364,38951.31,0,0,0,0,0,38951.31,1200,38951.31,86412.69,5.5E-2,2.5000000000000001E-2,3.8199999999999998E-2,3.2899999999999999E-2,1.25,0.8,0.25,13333.33,10447,3245.94,7201.06,5368.22,0,160000,125364,38951.31,86412.69,64418.59,0,13333.33,10447,3245.94,7201.06,6992.15,0,160000,125364,38951.31,86412.69,83905.74,0,1.34,0.40261621725910429,"PASS",1.02,0.52441088141458436,"PASS",1000000,{"$f":"IF(AND(DS30=GB30,DT30=GC30,DU30=GD30,DV30=GE30,DW30=GF30,DX30=GG30,DY30=GH30,DZ30=GI30,EA30=GJ30,EB30=GK30,EC30=GL30,ED30=GM30,EE30=GN30,EF30=GO30,EG30=GP30,EH30=GQ30,EI30=GR30,EJ30=GS30,EK30=GT30,EL30=GU30,EM30=GV30,EN30=GW30,EO30=GX30,EP30=GY30,EQ30=GZ30,ER30=HA30,ES30=HB30,ET30=HC30,EU30=HD30,EV30=HE30,EW30=HF30),\"Pass\",\"Fail\")","v":"Pass"},"Y","2021-07-05T16:28:21",null,"Case 28","Emily"]
[1500000,0.06,8.4999999999999992E-2,30,0,1500000,0.06,8.4999999999999992E-2,30,0,null,null,null,null,null,"Individual (Couple)","Individual (Couple)","Individual (Single)",null,null,null,"Applicant 2","Applicant 1",null,null,null,null,null,null,null,null,null,null,300000,10000,0,0,0,0,35000,0,35000,0,0,0,116000,0,0,0,0,0,15000,0,0,0,0,0,0,0,0,0,0,0,0,0,0,0,0,0,0,0,0,0,0,0,100,0,0,0,0,0,0,0,0,0,0,0,0,0,0,0,0,166187,0,0,0,0,0,299813,10000,35000,0,0,0,344813,61314.12,0,14607.63,0,0,0,75921.75,1200,75921.75,268891.25,5.5E-2,2.5000000000000001E-2,3.8199999999999998E-2,3.2899999999999999E-2,1.25,0.8,0.25,42583.33,28734.42,6326.81,22407.599999999999,8993.26,0,511000,344813,75921.75,268891.25,107919.09,0,42583.33,28734.42,6326.81,22407.599999999999,11533.7,0,511000,344813,75921.75,268891.25,138404.43,0,2.4900000000000002,0.21119196580723176,"PASS",1.94,0.27085015077334645,"PASS",1500000,166187,0,0,0,0,0,299813,10000,35000,0,0,0,344813,61314.12,0,14607.63,0,0,0,75921.75,1200,75921.75,268891.25,5.5E-2,2.5000000000000001E-2,3.8199999999999998E-2,3.2899999999999999E-2,1.25,0.8,0.25,42583.33,28734.42,6326.81,22407.599999999999,8993.26,0,511000,344813,75921.75,268891.25,107919.09,0,42583.33,28734.42,6326.81,22407.599999999999,11533.7,0,511000,344813,75921.75,268891.25,138404.43,0,2.4900000000000002,0.21119196580723176,"PASS",1.94,0.27085015077334645,"PASS",1500000,"Pass","Y","2021-07-05T16:28:40",null,"Case 29","Emily"]
[200000,0.05,7.5000000000000011E-2,30,0,200000,0.05,7.5000000000000011E-2,30,0,null,null,null,null,null,"Individual (Single)",null,null,null,null,null,null,null,null,null,null,null,1,null,null,null,null,null,107000,0,0,0,0,0,25000,0,0,0,0,0,0,0,0,0,0,0,0,0,0,0,0,0,0,0,0,0,0,0,0,0,0,0,0,0,0,0,0,0,0,0,100,0,0,0,0,0,0,0,0,0,0,0,0,0,10000,1000,1000,27382,0,0,0,0,0,104893,0,0,0,0,0,104893,36071.480000000003,0,0,0,0,0,36071.480000000003,1200,36071.480000000003,68821.52,5.5E-2,2.5000000000000001E-2,3.8199999999999998E-2,3.2899999999999999E-2,1.25,0.8,0.25,11000,8741.08,3005.96,5735.13,1073.6400000000001,2632,132000,104893,36071.480000000003,68821.52,12883.72,31584,11000,8741.08,3005.96,5735.13,1398.43,2632,132000,104893,36071.480000000003,68821.52,16781.150000000001,31584,1.54,0.33687665872947986,"PASS",1.42,0.36640263791868716,"PASS",200000,27382,0,0,0,0,0,104893,0,0,0,0,0,104893,36071.480000000003,0,0,0,0,0,36071.480000000003,1200,36071.480000000003,68821.52,5.5E-2,2.5000000000000001E-2,3.8199999999999998E-2,3.2899999999999999E-2,1.25,0.8,0.25,11000,8741.08,3005.96,5735.13,1073.6400000000001,2632,132000,104893,36071.480000000003,68821.52,12883.72,31584,11000,8741.08,3005.96,5735.13,1398.43,2632,132000,104893,36071.480000000003,68821.52,16781.150000000001,31584,1.54,0.33687665872947986,"PASS",1.42,0.36640263791868716,"PASS",200000,"Pass","Y","2021-07-05T16:28:59",null,"Case 30","Emily"]
[200000,0.05,7.5000000000000011E-2,30,0,200000,0.05,7.5000000000000011E-2,30,0,null,null,null,null,null,"Individual (Single)","","","","","","","","","","","",1,"","","","","",107000,0,0,0,0,0,0,0,0,0,0,0,0,0,0,0,0,0,0,0,0,0,0,0,0,0,0,0,0,0,0,0,0,0,0,0,0,0,0,0,0,0,100,0,0,0,0,0,0,0,0,0,0,0,0,0,10000,1000,1000,27382,0,0,0,0,0,79893,0,0,0,0,0,79893,31806.81,0,0,0,0,0,31806.81,1200,31806.81,48086.19,5.5E-2,2.5000000000000001E-2,3.8199999999999998E-2,3.2899999999999999E-2,1.25,0.8,0.25,8916.67,6657.75,2650.57,4007.18,1073.6400000000001,2632,107000,79893,31806.81,48086.19,12883.72,31584,8916.67,6657.75,2650.57,4007.18,1398.43,2632,107000,79893,31806.81,48086.19,16781.150000000001,31584,1.08,0.41558615843262936,"PASS",0.99,0.45201073089034305,"FAIL",196649.24,27382,0,0,0,0,0,79893,0,0,0,0,0,79893,31806.81,0,0,0,0,0,31806.81,1200,31806.81,48086.19,5.5E-2,2.5000000000000001E-2,3.8199999999999998E-2,3.2899999999999999E-2,1.25,0.8,0.25,8916.67,6657.75,2650.57,4007.18,1073.6400000000001,2632,107000,79893,31806.81,48086.19,12883.72,31584,8916.67,6657.75,2650.57,4007.18,1398.43,2632,107000,79893,31806.81,48086.19,16781.150000000001,31584,1.08,0.41558615843262936,"PASS",0.99,0.45201073089034305,"FAIL",196649.24,"Pass","Y","2021-07-05T16:29:18",null,"Case 31","Emily"]
[1500000,0.06,8.4999999999999992E-2,30,0,1500000,0.06,8.4999999999999992E-2,30,0,null,null,null,null,null,"Individual (Couple)","Individual (Couple)","Individual (Single)","Individual (Single)",null,null,"Applicant 2","Applicant 1",null,null,null,null,null,null,null,null,null,null,36000,10000,0,0,0,0,35000,0,35000,100000,0,0,0,0,0,0,0,0,10000,0,0,0,0,0,0,0,0,0,0,0,0,0,0,0,0,0,0,0,0,0,0,0,100,0,0,0,0,0,0,0,0,0,0,0,0,0,0,0,0,4102,0,0,0,0,0,77543,10000,35000,100000,0,0,222543,35646.69,0,14607.63,23820.07,0,0,74074.39,1200,74074.39,148468.60999999999,5.5E-2,2.5000000000000001E-2,3.8199999999999998E-2,3.2899999999999999E-2,1.25,0.8,0.25,18833.330000000002,18545.25,6172.87,12372.38,8993.26,0,226000,222543,74074.39,148468.60999999999,107919.09,0,18833.330000000002,18545.25,6172.87,12372.38,11533.7,0,226000,222543,74074.39,148468.60999999999,138404.43,0,1.37,0.47751811737829836,"PASS",1.07,0.61240896922646026,"FAIL",1287140.9099999999,4102,0,0,0,0,0,77543,10000,35000,100000,0,0,222543,35646.69,0,14607.63,23820.07,0,0,74074.39,1200,74074.39,148468.60999999999,5.5E-2,2.5000000000000001E-2,3.8199999999999998E-2,3.2899999999999999E-2,1.25,0.8,0.25,18833.330000000002,18545.25,6172.87,12372.38,8993.26,0,226000,222543,74074.39,148468.60999999999,107919.09,0,18833.330000000002,18545.25,6172.87,12372.38,11533.7,0,226000,222543,74074.39,148468.60999999999,138404.43,0,1.37,0.47751811737829836,"PASS",1.07,0.61240896922646026,"FAIL",1287140.9099999999,"Pass","Y","2021-07-05T16:29:37",null,"Case 32","Emily"]
[3000000,7.0000000000000007E-2,9.5000000000000001E-2,40,5,3000000,7.0000000000000007E-2,9.5000000000000001E-2,40,5,null,null,null,null,null,"Company","Individual (Single)","","","","","","","","","","","","","","","","",0,0,0,0,0,0,0,225000,0,0,0,0,87500,87500,0,0,0,0,22500,22500,0,0,0,0,0,0,0,0,0,0,0,0,0,0,0,0,0,0,0,0,0,0,0,0,0,0,0,0,0,0,0,0,4000,0,0,0,0,0,0,21875,20654.5,0,0,0,0,88125,314875.5,0,0,0,0,403000.5,0,49490.67,0,0,0,0,49490.67,48000,49490.67,353509.83,5.5E-2,2.5000000000000001E-2,3.8199999999999998E-2,3.2899999999999999E-2,1.25,0.8,0.25,37083.33,33583.379999999997,4124.22,29459.15,19165.689999999999,0,445000,403000.5,49490.67,353509.83,229988.29,0,37083.33,33583.379999999997,4124.22,29459.15,24648.35,0,445000,403000.5,49490.67,353509.83,295780.18,0,1.53,0.51682761588668136,"PASS",1.19,0.66467455388557506,"FAIL",2868386.96,21875,20654.5,0,0,0,0,88125,314875.5,0,0,0,0,403000.5,0,49490.67,0,0,0,0,49490.67,48000,49490.67,353509.83,5.5E-2,2.5000000000000001E-2,3.8199999999999998E-2,3.2899999999999999E-2,1.25,0.8,0.25,37083.33,33583.379999999997,4124.22,29459.15,19165.689999999999,0,445000,403000.5,49490.67,353509.83,229988.29,0,37083.33,33583.379999999997,4124.22,29459.15,24648.35,0,445000,403000.5,49490.67,353509.83,295780.18,0,1.53,0.51682761588668136,"PASS",1.19,0.66467455388557506,"FAIL",2868386.96,"Pass","Y","2021-07-05T16:29:56",null,"Case 33","Emily"]
[3000000,7.0000000000000007E-2,9.5000000000000001E-2,40,5,3000000,7.0000000000000007E-2,9.5000000000000001E-2,40,5,null,null,null,null,null,"Company","Individual (Single)","","","","","","","","","","","","","","","","",0,0,0,0,0,0,0,200000,0,0,0,0,87500,87500,0,0,0,0,22500,22500,0,0,0,0,0,0,0,0,0,0,0,0,0,0,0,0,0,0,0,0,0,0,0,0,0,0,0,0,0,0,0,0,4000,0,0,0,0,0,0,21875,20654.5,0,0,0,0,88125,289875.5,0,0,0,0,378000.5,0,47297.52,0,0,0,0,47297.52,48000,48000,330000.5,5.5E-2,2.5000000000000001E-2,3.8199999999999998E-2,3.2899999999999999E-2,1.25,0.8,0.25,35000,31500.04,4000,27500.04,19165.689999999999,0,420000,378000.5,48000,330000.5,229988.29,0,35000,31500.04,4000,27500.04,24648.35,0,420000,378000.5,48000,330000.5,295780.18,0,1.43,0.5475911644513648,"PASS",1.1100000000000001,0.70423851542638316,"PASS",3000000,21875,20654.5,0,0,0,0,88125,289875.5,0,0,0,0,378000.5,0,47297.52,0,0,0,0,47297.52,48000,48000,330000.5,5.5E-2,2.5000000000000001E-2,3.8199999999999998E-2,3.2899999999999999E-2,1.25,0.8,0.25,35000,31500.04,4000,27500.04,19165.689999999999,0,420000,378000.5,48000,330000.5,229988.29,0,35000,31500.04,4000,27500.04,24648.35,0,420000,378000.5,48000,330000.5,295780.18,0,1.43,0.5475911644513648,"PASS",1.1100000000000001,0.70423851542638316,"PASS",3000000,"Pass","Y","2021-07-05T16:30:15",null,"Case 34","Emily"]
[3000000,7.0000000000000007E-2,9.5000000000000001E-2,40,5,3000000,7.0000000000000007E-2,9.5000000000000001E-2,40,5,null,null,null,null,null,"Company","Individual (Single)","Individual (Couple)","Individual (Couple)","","","","","Applicant 4","Applicant 3","","","","",2,0,"","",0,225000,100000,80000,0,0,0,0,0,0,0,0,87500,87500,37500,12500,0,0,22500,22500,52500,17500,0,0,0,0,0,0,0,0,0,0,20000,20000,0,0,0,0,500000,500000,0,0,0,0,0,0,0,0,0,0,0,0,15000,0,0,0,25000,5000,3000,21875,117542,38516.5,22224.25,0,0,88125,217458,167483.5,104275,0,0,577341.5,0,49490.67,65292.38,0,0,0,114783.06,180000,180000,397341.5,5.5E-2,2.5000000000000001E-2,3.8199999999999998E-2,3.2899999999999999E-2,1.25,0.8,0.25,64750,48111.79,15000,33111.79,19165.689999999999,10205,777000,577341.5,180000,397341.5,229988.29,122460,64750,48111.79,15000,33111.79,24648.35,10205,777000,577341.5,180000,397341.5,295780.18,122460,1.1200000000000001,0.45360140163394236,"PASS",0.95,0.53827564540422257,"FAIL",2787935.32,21875,117542,38516.5,22224.25,0,0,88125,217458,167483.5,104275,0,0,577341.5,0,49490.67,65292.38,0,0,0,114783.06,180000,180000,397341.5,5.5E-2,2.5000000000000001E-2,3.8199999999999998E-2,3.2899999999999999E-2,1.25,0.8,0.25,64750,48111.79,15000,33111.79,19165.689999999999,10205,777000,577341.5,180000,397341.5,229988.29,122460,64750,48111.79,15000,33111.79,24648.35,10205,777000,577341.5,180000,397341.5,295780.18,122460,1.1200000000000001,0.45360140163394236,"PASS",0.95,0.53827564540422257,"FAIL",2787935.32,"Pass","Y","2021-07-05T16:30:34",null,"Case 35","Emily"]
[1500000,5.9900000000000002E-2,8.4900000000000003E-2,30,0,1500000,5.9900000000000002E-2,8.4900000000000003E-2,30,0,null,null,null,null,null,"Individual (Single)","Individual (Couple)","Company","Company","","","","Non-loan party","","","","","",3,"","","","",0,95000,0,25000,0,0,85000,0,0,0,0,0,0,0,0,0,0,0,0,0,0,20000,0,0,0,0,0,0,0,0,0,30000,30000,0,0,0,0,0,1000000,0,0,0,1,0,0,0,0,0,0,0,0,0,0,0,0,0,0,1000,0,0,31522,0,6250,0,0,85000,87573,24000,38750,0,0,235323,23820.07,48562.99,0,0,0,0,72383.070000000007,12,72383.070000000007,162939.93,5.5E-2,2.5000000000000001E-2,3.8199999999999998E-2,3.2899999999999999E-2,1.25,0.8,0.25,22750,19610.25,6031.92,13578.33,8983.6200000000008,1250,273000,235323,72383.070000000007,162939.93,107803.4,15000,22750,19610.25,6031.92,13578.33,11523.07,1250,273000,235323,72383.070000000007,162939.93,138276.88,15000,1.32,0.44982929052535398,"PASS",1.06,0.56145377214768011,"PASS",1500000,0,31522,0,6250,0,0,85000,87573,24000,38750,0,0,235323,23820.07,48562.99,0,0,0,0,72383.070000000007,12,72383.070000000007,162939.93,5.5E-2,2.5000000000000001E-2,3.8199999999999998E-2,3.2899999999999999E-2,1.25,0.8,0.25,22750,19610.25,6031.92,13578.33,8983.6200000000008,1250,273000,235323,72383.070000000007,162939.93,107803.4,15000,22750,19610.25,6031.92,13578.33,11523.07,1250,273000,235323,72383.070000000007,162939.93,138276.88,15000,1.32,0.44982929052535398,"PASS",1.06,0.56145377214768011,"PASS",1500000,{"$f":"IF(AND(DS38=GB38,DT38=GC38,DU38=GD38,DV38=GE38,DW38=GF38,DX38=GG38,DY38=GH38,DZ38=GI38,EA38=GJ38,EB38=GK38,EC38=GL38,ED38=GM38,EE38=GN38,EF38=GO38,EG38=GP38,EH38=GQ38,EI38=GR38,EJ38=GS38,EK38=GT38,EL38=GU38,EM38=GV38,EN38=GW38,EO38=GX38,EP38=GY38,EQ38=GZ38,ER38=HA38,ES38=HB38,ET38=HC38,EU38=HD38,EV38=HE38,EW38=HF38),\"Pass\",\"Fail\")","v":"Pass"},"Y","2021-07-05T16:41:50",null,"Case 36","Emily"]
[300000,5.0900000000000001E-2,7.5899999999999995E-2,30,0,300000,5.0900000000000001E-2,7.5899999999999995E-2,30,0,null,null,null,null,null,"Individual (Couple)","Individual (Couple)","","","","","Non-loan Party","Non-loan party","","","","",3,"","","","","",72735,0,0,0,0,0,0,0,0,0,0,0,0,0,0,0,0,0,0,0,0,0,0,0,0,0,0,0,0,0,0,0,0,0,0,0,0,0,0,0,0,0,285,291,0,260,1100,400,700,0,69,48,0,0,0,1275,32500,1275,0,15560.58,0,0,0,0,0,57704.43,0,0,0,0,0,57704.43,41676.42,25749.66,0,0,0,0,67426.080000000002,37836,67426.080000000002,-9721.65,5.5E-2,2.5000000000000001E-2,3.8199999999999998E-2,3.2899999999999999E-2,1.25,0.8,0.25,6061.25,4808.7,5618.84,-810.14,1627.01,4110.25,72735,57704.43,67426.080000000002,-9721.65,19524.080000000002,49323,6061.25,4808.7,5618.84,-810.14,2116.16,4110.25,72735,57704.43,67426.080000000002,-9721.65,25393.95,49323,-0.14000000000000001,0.73619408726042612,"FAIL",-0.13,0.81689630477657993,"FAIL",0,15560.58,0,0,0,0,0,57704.43,0,0,0,0,0,57704.43,41676.42,25749.66,0,0,0,0,67426.080000000002,37836,67426.080000000002,-9721.65,5.5E-2,2.5000000000000001E-2,3.8199999999999998E-2,3.2899999999999999E-2,1.25,0.8,0.25,6061.25,4808.7,5618.84,-810.14,1627.01,4110.25,72735,57704.43,67426.080000000002,-9721.65,19524.080000000002,49323,6061.25,4808.7,5618.84,-810.14,2116.16,4110.25,72735,57704.43,67426.080000000002,-9721.65,25393.95,49323,-0.14000000000000001,0.73619408726042612,"FAIL",-0.13,0.81689630477657993,"FAIL",0,"Pass","Y","2021-07-05T16:31:12",null,"Case 37","Emily"]
[300000,0.06,8.4999999999999992E-2,40,0,300000,0.06,8.4999999999999992E-2,40,0,null,null,null,null,null,"Individual (Single)","Individual (Single)","","","","","","","","","","","","","","","","",0,1,0,0,0,0,0,0,0,0,0,0,0,0,0,0,0,0,0,0,0,0,0,0,0,0,0,0,0,0,0,0,0,0,0,0,0,0,0,0,0,0,1,1,1,1,1,1,1,1,1,1,1,1,1,0,0,0,0,0,0,0,0,0,0,0,1,0,0,0,0,1,13206.69,13206.69,0,0,0,0,26413.38,156,26413.38,-26412.38,5.5E-2,2.5000000000000001E-2,3.8199999999999998E-2,3.2899999999999999E-2,1.25,0.8,0.25,0.08,0.08,2201.12,-2201.0300000000002,1650.64,0,1,1,26413.38,-26412.38,19807.689999999999,0,0.08,0.08,2201.12,-2201.0300000000002,2199.2800000000002,0,1,1,26413.38,-26412.38,26391.39,0,-1.33,19807.691061745812,"FAIL",-1,26391.386458395049,"FAIL",0,0,0,0,0,0,0,0,1,0,0,0,0,1,13206.69,13206.69,0,0,0,0,26413.38,156,26413.38,-26412.38,5.5E-2,2.5000000000000001E-2,3.8199999999999998E-2,3.2899999999999999E-2,1.25,0.8,0.25,0.08,0.08,2201.12,-2201.0300000000002,1650.64,0,1,1,26413.38,-26412.38,19807.689999999999,0,0.08,0.08,2201.12,-2201.0300000000002,2199.2800000000002,0,1,1,26413.38,-26412.38,26391.39,0,-1.33,19807.691061745812,"FAIL",-1,26391.386458395049,"FAIL",0,"Pass","Y","2021-07-05T16:31:31",null,"Case 38","Emily"]
[100000,6.5000000000000002E-2,0.09,20,0,100000,6.5000000000000002E-2,0.09,20,0,null,null,null,null,null,"Individual (Couple)","","","","","","Non-loan Party","","","","","","","","","","","",25000,0,0,0,0,0,0,0,0,0,0,0,0,0,0,0,0,0,0,0,0,0,0,0,0,0,0,0,0,0,0,0,0,0,0,0,0,0,0,0,0,0,1,1000,1,50,1,100,200,1,500,1,1,1,1,0,0,0,0,1594,0,0,0,0,0,24051,0,0,0,0,0,24051,25749.66,0,0,0,0,0,25749.66,22296,25749.66,-1698.66,5.5E-2,2.5000000000000001E-2,3.8199999999999998E-2,3.2899999999999999E-2,1.25,0.8,0.25,2083.33,2004.25,2145.8000000000002,-141.55000000000001,745.57,0,25000,24051,25749.66,-1698.66,8946.8799999999992,0,2083.33,2004.25,2145.8000000000002,-141.55000000000001,899.73,0,25000,24051,25749.66,-1698.66,10796.71,0,-0.18,0.35787510504724657,"FAIL",-0.15,0.43186845880808311,"FAIL",0,1594,0,0,0,0,0,24051,0,0,0,0,0,24051,25749.66,0,0,0,0,0,25749.66,22296,25749.66,-1698.66,5.5E-2,2.5000000000000001E-2,3.8199999999999998E-2,3.2899999999999999E-2,1.25,0.8,0.25,2083.33,2004.25,2145.8000000000002,-141.55000000000001,745.57,0,25000,24051,25749.66,-1698.66,8946.8799999999992,0,2083.33,2004.25,2145.8000000000002,-141.55000000000001,899.73,0,25000,24051,25749.66,-1698.66,10796.71,0,-0.18,0.35787510504724657,"FAIL",-0.15,0.43186845880808311,"FAIL",0,"Pass","Y","2021-07-05T16:31:50",null,"Case 39","Emily"]
[100000,6.5000000000000002E-2,0.09,20,0,100000,6.5000000000000002E-2,0.09,20,0,null,null,null,null,null,"Individual (Couple)","","","","","","Non-loan Party","","","","","","","","","","","",50000,0,0,0,0,0,0,0,0,0,0,0,0,0,0,0,0,0,0,0,0,0,0,0,0,0,0,0,0,0,0,0,0,0,0,0,0,0,0,0,0,0,1,1000,1,50,1,100,200,1,500,1,1,1,1,0,0,0,0,7717,0,0,0,0,0,43063,0,0,0,0,0,43063,27489.02,0,0,0,0,0,27489.02,22296,27489.02,15573.98,5.5E-2,2.5000000000000001E-2,3.8199999999999998E-2,3.2899999999999999E-2,1.25,0.8,0.25,4166.67,3588.58,2290.75,1297.83,745.57,0,50000,43063,27489.02,15573.98,8946.8799999999992,0,4166.67,3588.58,2290.75,1297.83,899.73,0,50000,43063,27489.02,15573.98,10796.71,0,1.74,0.17893755252362328,"PASS",1.44,0.21593422940404156,"PASS",100000,7717,0,0,0,0,0,43063,0,0,0,0,0,43063,27489.02,0,0,0,0,0,27489.02,22296,27489.02,15573.98,5.5E-2,2.5000000000000001E-2,3.8199999999999998E-2,3.2899999999999999E-2,1.25,0.8,0.25,4166.67,3588.58,2290.75,1297.83,745.57,0,50000,43063,27489.02,15573.98,8946.8799999999992,0,4166.67,3588.58,2290.75,1297.83,899.73,0,50000,43063,27489.02,15573.98,10796.71,0,1.74,0.17893755252362328,"PASS",1.44,0.21593422940404156,"PASS",100000,"Pass","Y","2021-07-05T16:32:09",null,"Case 40","Emily"]
[300000,6.5000000000000002E-2,0.09,20,0,300000,6.5000000000000002E-2,0.09,20,0,null,null,null,null,null,"Individual (Couple)","Individual (Couple)","","","","","Applicant 2","Applicant 1","","","","","","","","","","",85000,45000,0,0,0,0,0,0,0,0,0,0,0,0,0,0,0,0,0,0,0,0,0,0,0,0,0,0,0,0,0,0,0,0,0,0,0,0,0,0,0,0,1,1000,500,50,1,100,200,500,500,1,1,1,1,0,0,0,0,19792,5992,0,0,0,0,65738,39773,0,0,0,0,105511,43237.88,0,0,0,0,0,43237.88,34272,43237.88,62273.120000000003,5.5E-2,2.5000000000000001E-2,3.8199999999999998E-2,3.2899999999999999E-2,1.25,0.8,0.25,10833.33,8792.58,3603.16,5189.43,2236.7199999999998,0,130000,105511,43237.88,62273.120000000003,26840.63,0,10833.33,8792.58,3603.16,5189.43,2699.18,0,130000,105511,43237.88,62273.120000000003,32390.13,0,2.3199999999999998,0.20646640675802683,"PASS",1.92,0.24915488008158634,"PASS",300000,19792,5992,0,0,0,0,65738,39773,0,0,0,0,105511,43237.88,0,0,0,0,0,43237.88,34272,43237.88,62273.120000000003,5.5E-2,2.5000000000000001E-2,3.8199999999999998E-2,3.2899999999999999E-2,1.25,0.8,0.25,10833.33,8792.58,3603.16,5189.43,2236.7199999999998,0,130000,105511,43237.88,62273.120000000003,26840.63,0,10833.33,8792.58,3603.16,5189.43,2699.18,0,130000,105511,43237.88,62273.120000000003,32390.13,0,2.3199999999999998,0.20646640675802683,"PASS",1.92,0.24915488008158634,"PASS",300000,"Pass","Y","2021-07-05T16:32:28",null,"Case 41","Emily"]
[300000,6.5000000000000002E-2,0.09,20,0,300000,6.5000000000000002E-2,0.09,20,0,null,null,null,null,null,"Individual (Couple)","Individual (Couple)","","","","","Applicant 2","Applicant 1","","","","","","","","","","",85000,45000,0,0,0,0,0,0,0,0,0,0,0,0,0,0,0,0,0,0,0,0,0,0,0,0,0,0,0,0,0,0,0,0,0,0,0,0,0,0,0,0,1,1000,500,50,1,100,200,500,500,200,1,400,1,0,0,1800,0,19792,5992,0,0,0,0,65738,39773,0,0,0,0,105511,43237.88,0,0,0,0,0,43237.88,41448,43237.88,62273.120000000003,5.5E-2,2.5000000000000001E-2,3.8199999999999998E-2,3.2899999999999999E-2,1.25,0.8,0.25,10833.33,8792.58,3603.16,5189.43,2236.7199999999998,2250,130000,105511,43237.88,62273.120000000003,26840.63,27000,10833.33,8792.58,3603.16,5189.43,2699.18,2250,130000,105511,43237.88,62273.120000000003,32390.13,27000,1.1499999999999999,0.41415871445033453,"PASS",1.04,0.45684718777389405,"PASS",300000,19792,5992,0,0,0,0,65738,39773,0,0,0,0,105511,43237.88,0,0,0,0,0,43237.88,41448,43237.88,62273.120000000003,5.5E-2,2.5000000000000001E-2,3.8199999999999998E-2,3.2899999999999999E-2,1.25,0.8,0.25,10833.33,8792.58,3603.16,5189.43,2236.7199999999998,2250,130000,105511,43237.88,62273.120000000003,26840.63,27000,10833.33,8792.58,3603.16,5189.43,2699.18,2250,130000,105511,43237.88,62273.120000000003,32390.13,27000,1.1499999999999999,0.41415871445033453,"PASS",1.04,0.45684718777389405,"PASS",300000,"Pass","Y","2021-07-05T16:32:47",null,"Case 42","Emily"]
[700000,6.5000000000000002E-2,0.09,30,0,700000,6.5000000000000002E-2,0.09,30,0,null,null,null,null,null,"Individual (Couple)","Individual (Couple)","","","","","Applicant 2","Applicant 1","","","","","","","","","","",100000,45000,0,0,0,0,0,0,0,0,0,0,0,0,0,0,0,0,0,0,0,0,0,0,0,0,0,0,0,0,0,0,0,0,0,0,0,0,0,0,0,0,1,1,1,50,1,100,200,500,500,200,1,400,1,0,0,1800,0,24967,5992,0,0,0,0,75413,39773,0,0,0,0,115186,43237.88,0,0,0,0,0,43237.88,23472,43237.88,71948.12,5.5E-2,2.5000000000000001E-2,3.8199999999999998E-2,3.2899999999999999E-2,1.25,0.8,0.25,12083.33,9598.83,3603.16,5995.68,4424.4799999999996,2250,145000,115186,43237.88,71948.12,53093.71,27000,12083.33,9598.83,3603.16,5995.68,5632.36,2250,145000,115186,43237.88,71948.12,67588.3,27000,0.89,0.55237044119592382,"FAIL",0.76,0.65233310223008101,"FAIL",465435.59,24967,5992,0,0,0,0,75413,39773,0,0,0,0,115186,43237.88,0,0,0,0,0,43237.88,23472,43237.88,71948.12,5.5E-2,2.5000000000000001E-2,3.8199999999999998E-2,3.2899999999999999E-2,1.25,0.8,0.25,12083.33,9598.83,3603.16,5995.68,4424.4799999999996,2250,145000,115186,43237.88,71948.12,53093.71,27000,12083.33,9598.83,3603.16,5995.68,5632.36,2250,145000,115186,43237.88,71948.12,67588.3,27000,0.89,0.55237044119592382,"FAIL",0.76,0.65233310223008101,"FAIL",465435.59,"Pass","Y","2021-07-05T16:33:07",null,"Case 43","Emily"]
[160000,6.5000000000000002E-2,0.09,30,0,160000,6.5000000000000002E-2,0.09,30,0,null,null,null,null,null,"Individual (Couple)","Individual (Couple)","","","","","Applicant 2","Applicant 1","","","","","","","","","","",56000,35000,0,0,0,0,0,0,0,0,0,0,0,0,0,0,0,0,0,0,0,0,0,0,0,0,0,0,0,0,0,0,0,0,0,0,0,0,0,0,0,0,600,1,50,300,41,100,200,480,500,120,1,350,1,0,0,1800,0,9787,3892,0,0,0,0,46903,31753,0,0,0,0,78656,35646.69,0,0,0,0,0,35646.69,32928,35646.69,43009.31,5.5E-2,2.5000000000000001E-2,3.8199999999999998E-2,3.2899999999999999E-2,1.25,0.8,0.25,7583.33,6554.67,2970.56,3584.11,1011.31,2250,91000,78656,35646.69,43009.31,12135.71,27000,7583.33,6554.67,2970.56,3584.11,1287.4000000000001,2250,91000,78656,35646.69,43009.31,15448.75,27000,1.0900000000000001,0.43006270385785605,"PASS",1.01,0.46646982687186622,"PASS",160000,9787,3892,0,0,0,0,46903,31753,0,0,0,0,78656,35646.69,0,0,0,0,0,35646.69,32928,35646.69,43009.31,5.5E-2,2.5000000000000001E-2,3.8199999999999998E-2,3.2899999999999999E-2,1.25,0.8,0.25,7583.33,6554.67,2970.56,3584.11,1011.31,2250,91000,78656,35646.69,43009.31,12135.71,27000,7583.33,6554.67,2970.56,3584.11,1287.4000000000001,2250,91000,78656,35646.69,43009.31,15448.75,27000,1.0900000000000001,0.43006270385785605,"PASS",1.01,0.46646982687186622,"PASS",160000,"Pass","Y","2021-07-05T16:33:25",null,"Case 44","Emily"]
[160000,6.5000000000000002E-2,0.09,30,0,160000,6.5000000000000002E-2,0.09,30,0,null,null,null,null,null,"Individual (Couple)","Individual (Couple)","","","","","Applicant 2","Applicant 1","","","","","","","","","","",58000,35000,0,0,0,0,0,0,0,0,0,0,0,0,0,0,0,0,0,0,0,0,0,0,0,0,0,0,0,0,0,0,0,0,0,0,0,0,0,0,0,0,600,1,300,50,1,100,200,480,500,200,1,400,1,0,0,1800,0,10477,3892,0,0,0,0,48183,31753,0,0,0,0,79936,35646.69,0,0,0,0,0,35646.69,34008,35646.69,44289.31,5.5E-2,2.5000000000000001E-2,3.8199999999999998E-2,3.2899999999999999E-2,1.25,0.8,0.25,7750,6661.33,2970.56,3690.78,1011.31,2250,93000,79936,35646.69,44289.31,12135.71,27000,7750,6661.33,2970.56,3690.78,1287.4000000000001,2250,93000,79936,35646.69,44289.31,15448.75,27000,1.1299999999999999,0.42081404355983765,"PASS",1.04,0.45643821769182608,"PASS",160000,10477,3892,0,0,0,0,48183,31753,0,0,0,0,79936,35646.69,0,0,0,0,0,35646.69,34008,35646.69,44289.31,5.5E-2,2.5000000000000001E-2,3.8199999999999998E-2,3.2899999999999999E-2,1.25,0.8,0.25,7750,6661.33,2970.56,3690.78,1011.31,2250,93000,79936,35646.69,44289.31,12135.71,27000,7750,6661.33,2970.56,3690.78,1287.4000000000001,2250,93000,79936,35646.69,44289.31,15448.75,27000,1.1299999999999999,0.42081404355983765,"PASS",1.04,0.45643821769182608,"PASS",160000,"Pass","Y","2021-07-05T16:33:43",null,"Case 45","Emily"]
[100000,6.5000000000000002E-2,0.09,20,0,100000,6.5000000000000002E-2,0.09,20,0,null,null,null,null,null,"Individual (Couple)","","","","","","Non-loan Party","","","","","","","","","","","",41000,0,0,0,0,0,0,0,0,0,0,0,0,0,0,0,0,0,0,0,0,0,0,0,0,0,0,0,0,0,0,0,0,0,0,0,0,0,0,0,0,0,1,1000,1,50,1,100,200,1,500,1,1,1,1,0,0,0,0,5152,0,0,0,0,0,36553,0,0,0,0,0,36553,26435.38,0,0,0,0,0,26435.38,22296,26435.38,10117.620000000001,5.5E-2,2.5000000000000001E-2,3.8199999999999998E-2,3.2899999999999999E-2,1.25,0.8,0.25,3416.67,3046.08,2202.9499999999998,843.14,745.57,0,41000,36553,26435.38,10117.620000000001,8946.8799999999992,0,3416.67,3046.08,2202.9499999999998,843.14,899.73,0,41000,36553,26435.38,10117.620000000001,10796.71,0,1.1299999999999999,0.21821652746783327,"PASS",0.93,0.26333442610248969,"FAIL",93695.2,5152,0,0,0,0,0,36553,0,0,0,0,0,36553,26435.38,0,0,0,0,0,26435.38,22296,26435.38,10117.620000000001,5.5E-2,2.5000000000000001E-2,3.8199999999999998E-2,3.2899999999999999E-2,1.25,0.8,0.25,3416.67,3046.08,2202.9499999999998,843.14,745.57,0,41000,36553,26435.38,10117.620000000001,8946.8799999999992,0,3416.67,3046.08,2202.9499999999998,843.14,899.73,0,41000,36553,26435.38,10117.620000000001,10796.71,0,1.1299999999999999,0.21821652746783327,"PASS",0.93,0.26333442610248969,"FAIL",93695.2,"Pass","Y","2021-07-05T16:34:02",null,"Case 46","Emily"]
[145000,6.5000000000000002E-2,0.09,20,0,145000,6.5000000000000002E-2,0.09,20,0,null,null,null,null,null,"Individual (Couple)","","","","","","Non-loan Party","","","","","","","","","","","",51000,0,0,0,0,0,0,0,0,0,0,0,0,0,0,0,0,0,0,0,0,0,0,0,0,0,0,0,0,0,0,0,0,0,0,0,0,0,0,0,0,0,1,1000,1,250,1,100,200,1,500,1,200,1,1,0,0,0,0,8062,0,0,0,0,0,43703,0,0,0,0,0,43703,27489.02,0,0,0,0,0,27489.02,27084,27489.02,16213.98,5.5E-2,2.5000000000000001E-2,3.8199999999999998E-2,3.2899999999999999E-2,1.25,0.8,0.25,4250,3641.92,2290.75,1351.16,1081.08,0,51000,43703,27489.02,16213.98,12972.97,0,4250,3641.92,2290.75,1351.16,1304.5999999999999,0,51000,43703,27489.02,16213.98,15655.23,0,1.24,0.25437201094044481,"PASS",1.03,0.3069653261135884,"PASS",145000,8062,0,0,0,0,0,43703,0,0,0,0,0,43703,27489.02,0,0,0,0,0,27489.02,27084,27489.02,16213.98,5.5E-2,2.5000000000000001E-2,3.8199999999999998E-2,3.2899999999999999E-2,1.25,0.8,0.25,4250,3641.92,2290.75,1351.16,1081.08,0,51000,43703,27489.02,16213.98,12972.97,0,4250,3641.92,2290.75,1351.16,1304.5999999999999,0,51000,43703,27489.02,16213.98,15655.23,0,1.24,0.25437201094044481,"PASS",1.03,0.3069653261135884,"PASS",145000,"Pass","Y","2021-07-05T16:34:20",null,"Case 47","Emily"]
[300000,5.4399999999999997E-2,7.9399999999999998E-2,30,0,300000,5.4399999999999997E-2,7.9399999999999998E-2,30,0,null,null,null,null,null,"Individual (Single)","","","","","","","","","","","","","","","","","",80000,0,0,0,0,0,0,0,0,0,0,0,0,0,0,0,0,0,0,0,0,0,0,0,0,0,0,0,0,0,0,0,0,0,0,0,0,0,0,0,0,0,1,1,1,1,100,50,60,50,20,45,60,1,1,0,0,0,0,18067,0,0,0,0,0,62463,0,0,0,0,0,62463,20169.12,0,0,0,0,0,20169.12,4692,20169.12,42293.88,5.5E-2,2.5000000000000001E-2,3.8199999999999998E-2,3.2899999999999999E-2,1.25,0.8,0.25,6666.67,5205.25,1680.76,3524.49,1692.09,0,80000,62463,20169.12,42293.88,20305.09,0,6666.67,5205.25,1680.76,3524.49,2188.7600000000002,0,80000,62463,20169.12,42293.88,26265.1,0,2.08,0.25381360981084861,"PASS",1.61,0.32831378032817848,"PASS",300000,18067,0,0,0,0,0,62463,0,0,0,0,0,62463,20169.12,0,0,0,0,0,20169.12,4692,20169.12,42293.88,5.5E-2,2.5000000000000001E-2,3.8199999999999998E-2,3.2899999999999999E-2,1.25,0.8,0.25,6666.67,5205.25,1680.76,3524.49,1692.09,0,80000,62463,20169.12,42293.88,20305.09,0,6666.67,5205.25,1680.76,3524.49,2188.7600000000002,0,80000,62463,20169.12,42293.88,26265.1,0,2.08,0.25381360981084861,"PASS",1.61,0.32831378032817848,"PASS",300000,"Pass","Y","2021-07-05T16:34:39",null,"Case 48","Emily"]
[300000,5.4399999999999997E-2,7.9399999999999998E-2,30,0,300000,5.4399999999999997E-2,7.9399999999999998E-2,30,0,null,null,null,null,null,"Individual (Single)","","","","","","","","","","","","","","","","","",60000,0,0,0,0,0,0,0,0,0,0,0,0,0,0,0,0,0,0,0,0,0,0,0,0,0,0,0,0,0,0,0,0,0,0,0,0,0,0,0,0,0,1,1,1,1,100,50,60,50,20,45,60,1,1,0,0,0,0,11167,0,0,0,0,0,49463,0,0,0,0,0,49463,17436.37,0,0,0,0,0,17436.37,4692,17436.37,32026.63,5.5E-2,2.5000000000000001E-2,3.8199999999999998E-2,3.2899999999999999E-2,1.25,0.8,0.25,5000,4121.92,1453.03,2668.89,1692.09,0,60000,49463,17436.37,32026.63,20305.09,0,5000,4121.92,1453.03,2668.89,2188.7600000000002,0,60000,49463,17436.37,32026.63,26265.1,0,1.57,0.33841814641446483,"PASS",1.21,0.43775170710423794,"PASS",300000,11167,0,0,0,0,0,49463,0,0,0,0,0,49463,17436.37,0,0,0,0,0,17436.37,4692,17436.37,32026.63,5.5E-2,2.5000000000000001E-2,3.8199999999999998E-2,3.2899999999999999E-2,1.25,0.8,0.25,5000,4121.92,1453.03,2668.89,1692.09,0,60000,49463,17436.37,32026.63,20305.09,0,5000,4121.92,1453.03,2668.89,2188.7600000000002,0,60000,49463,17436.37,32026.63,26265.1,0,1.57,0.33841814641446483,"PASS",1.21,0.43775170710423794,"PASS",300000,"Pass","Y","2021-07-05T16:34:57",null,"Case 49","Emily"]
[300000,5.3999999999999999E-2,7.9000000000000001E-2,30,0,300000,5.3999999999999999E-2,7.9000000000000001E-2,30,0,null,null,null,null,null,"Individual (Single)","Individual (Single)","","","","","","","","","","","","","","","","",45000,45000,0,0,0,0,0,0,0,0,0,0,0,0,0,0,0,0,0,0,0,0,0,0,0,0,0,0,0,0,0,0,0,0,0,0,0,0,0,0,0,0,100,100,100,100,100,100,500,10,100,500,300,100,100,0,0,0,0,5992,5992,0,0,0,0,39773,39773,0,0,0,0,79546,15661.4,15661.4,0,0,0,0,31322.81,26520,31322.81,48223.19,5.5E-2,2.5000000000000001E-2,3.8199999999999998E-2,3.2899999999999999E-2,1.25,0.8,0.25,7500,6628.83,2610.23,4018.6,1684.59,0,90000,79546,31322.81,48223.19,20215.11,0,7500,6628.83,2610.23,4018.6,2180.42,0,90000,79546,31322.81,48223.19,26164.99,0,2.38,0.22461231674784571,"PASS",1.84,0.29072216210030244,"PASS",300000,5992,5992,0,0,0,0,39773,39773,0,0,0,0,79546,15661.4,15661.4,0,0,0,0,31322.81,26520,31322.81,48223.19,5.5E-2,2.5000000000000001E-2,3.8199999999999998E-2,3.2899999999999999E-2,1.25,0.8,0.25,7500,6628.83,2610.23,4018.6,1684.59,0,90000,79546,31322.81,48223.19,20215.11,0,7500,6628.83,2610.23,4018.6,2180.42,0,90000,79546,31322.81,48223.19,26164.99,0,2.38,0.22461231674784571,"PASS",1.84,0.29072216210030244,"PASS",300000,"Pass","Y","2021-07-05T16:35:16",null,"Case 50","Emily"]
[300000,5.3999999999999999E-2,7.9000000000000001E-2,30,0,300000,5.3999999999999999E-2,7.9000000000000001E-2,30,0,null,null,null,null,null,"Individual (Single)","Individual (Single)","","","","","","","","","","","","","","","","",45000,25000,0,0,0,0,0,0,0,0,0,0,0,0,0,0,0,0,0,0,0,0,0,0,0,0,0,0,0,0,0,0,0,0,0,0,0,0,0,0,0,0,100,100,100,100,100,100,500,10,100,500,300,100,100,0,0,0,0,5992,1594,0,0,0,0,39773,24051,0,0,0,0,63824,15661.4,13921.82,0,0,0,0,29583.23,26520,29583.23,34240.769999999997,5.5E-2,2.5000000000000001E-2,3.8199999999999998E-2,3.2899999999999999E-2,1.25,0.8,0.25,5833.33,5318.67,2465.27,2853.4,1684.59,0,70000,63824,29583.23,34240.769999999997,20215.11,0,5833.33,5318.67,2465.27,2853.4,2180.42,0,70000,63824,29583.23,34240.769999999997,26164.99,0,1.69,0.28878726439008734,"PASS",1.3,0.37378563698610318,"PASS",300000,5992,1594,0,0,0,0,39773,24051,0,0,0,0,63824,15661.4,13921.82,0,0,0,0,29583.23,26520,29583.23,34240.769999999997,5.5E-2,2.5000000000000001E-2,3.8199999999999998E-2,3.2899999999999999E-2,1.25,0.8,0.25,5833.33,5318.67,2465.27,2853.4,1684.59,0,70000,63824,29583.23,34240.769999999997,20215.11,0,5833.33,5318.67,2465.27,2853.4,2180.42,0,70000,63824,29583.23,34240.769999999997,26164.99,0,1.69,0.28878726439008734,"PASS",1.3,0.37378563698610318,"PASS",300000,"Pass","Y","2021-07-05T16:35:35",null,"Case 51","Emily"]
[300000,0.02,5.8500000000000003E-2,30,0,300000,0.02,5.8500000000000003E-2,30,0,null,null,null,null,null,"Individual (Single)","","","","","","","","","","","","","","","","","",80000,0,0,0,0,0,0,0,0,0,0,0,0,0,0,0,0,0,0,0,0,0,0,0,0,0,0,0,0,0,0,0,0,0,0,0,0,0,0,0,0,0,1,1,1,1,100,50,60,50,20,45,60,1,1,0,0,0,0,18067,0,0,0,0,0,62463,0,0,0,0,0,62463,20169.12,0,0,0,0,0,20169.12,4692,20169.12,42293.88,5.5E-2,2.5000000000000001E-2,3.8199999999999998E-2,3.2899999999999999E-2,1.25,0.8,0.25,6666.67,5205.25,1680.76,3524.49,1108.8599999999999,0,80000,62463,20169.12,42293.88,13306.3,0,6666.67,5205.25,1680.76,3524.49,1703.37,0,80000,62463,20169.12,42293.88,20440.400000000001,0,3.17,0.16632876270996924,"PASS",2.06,0.25550505060615131,"PASS",300000,18067,0,0,0,0,0,62463,0,0,0,0,0,62463,20169.12,0,0,0,0,0,20169.12,4692,20169.12,42293.88,5.5E-2,2.5000000000000001E-2,3.8199999999999998E-2,3.2899999999999999E-2,1.25,0.8,0.25,6666.67,5205.25,1680.76,3524.49,1108.8599999999999,0,80000,62463,20169.12,42293.88,13306.3,0,6666.67,5205.25,1680.76,3524.49,1703.37,0,80000,62463,20169.12,42293.88,20440.400000000001,0,3.17,0.16632876270996924,"PASS",2.06,0.25550505060615131,"PASS",300000,{"$f":"IF(AND(DS54=GB54,DT54=GC54,DU54=GD54,DV54=GE54,DW54=GF54,DX54=GG54,DY54=GH54,DZ54=GI54,EA54=GJ54,EB54=GK54,EC54=GL54,ED54=GM54,EE54=GN54,EF54=GO54,EG54=GP54,EH54=GQ54,EI54=GR54,EJ54=GS54,EK54=GT54,EL54=GU54,EM54=GV54,EN54=GW54,EO54=GX54,EP54=GY54,EQ54=GZ54,ER54=HA54,ES54=HB54,ET54=HC54,EU54=HD54,EV54=HE54,EW54=HF54),\"Pass\",\"Fail\")","v":"Pass"},"Y","2021-07-05T16:35:54",null,"Case 52","Emily"]
[300000,0.03,5.8500000000000003E-2,30,0,300000,0.03,5.8500000000000003E-2,30,0,null,null,null,null,null,"Individual (Single)","","","","","","","","","","","","","","","","","",60000,0,0,0,0,0,0,0,0,0,0,0,0,0,0,0,0,0,0,0,0,0,0,0,0,0,0,0,0,0,0,0,0,0,0,0,0,0,0,0,0,0,1,1,1,1,100,50,60,50,20,45,60,1,1,0,0,0,0,11167,0,0,0,0,0,49463,0,0,0,0,0,49463,17436.37,0,0,0,0,0,17436.37,4692,17436.37,32026.63,5.5E-2,2.5000000000000001E-2,3.8199999999999998E-2,3.2899999999999999E-2,1.25,0.8,0.25,5000,4121.92,1453.03,2668.89,1264.81,0,60000,49463,17436.37,32026.63,15177.75,0,5000,4121.92,1453.03,2668.89,1703.37,0,60000,49463,17436.37,32026.63,20440.400000000001,0,2.11,0.25296242023767029,"PASS",1.56,0.34067340080820169,"PASS",300000,11167,0,0,0,0,0,49463,0,0,0,0,0,49463,17436.37,0,0,0,0,0,17436.37,4692,17436.37,32026.63,5.5E-2,2.5000000000000001E-2,3.8199999999999998E-2,3.2899999999999999E-2,1.25,0.8,0.25,5000,4121.92,1453.03,2668.89,1264.81,0,60000,49463,17436.37,32026.63,15177.75,0,5000,4121.92,1453.03,2668.89,1703.37,0,60000,49463,17436.37,32026.63,20440.400000000001,0,2.11,0.25296242023767029,"PASS",1.56,0.34067340080820169,"PASS",300000,"Pass","Y","2021-07-05T16:36:12",null,"Case 53","Emily"]
[300000,3.3399999999999999E-2,5.8500000000000003E-2,30,0,300000,3.3399999999999999E-2,5.8500000000000003E-2,30,0,null,null,null,null,null,"Individual (Single)","Individual (Single)","","","","","","","","","","","","","","","","",45000,45000,0,0,0,0,0,0,0,0,0,0,0,0,0,0,0,0,0,0,0,0,0,0,0,0,0,0,0,0,0,0,0,0,0,0,0,0,0,0,0,0,100,100,100,100,100,100,500,10,100,500,300,100,100,0,0,0,0,5992,5992,0,0,0,0,39773,39773,0,0,0,0,79546,15661.4,15661.4,0,0,0,0,31322.81,26520,31322.81,48223.19,5.5E-2,2.5000000000000001E-2,3.8199999999999998E-2,3.2899999999999999E-2,1.25,0.8,0.25,7500,6628.83,2610.23,4018.6,1320.48,0,90000,79546,31322.81,48223.19,15845.8,0,7500,6628.83,2610.23,4018.6,1767.91,0,90000,79546,31322.81,48223.19,21214.9,0,3.04,0.17606444647275668,"PASS",2.27,0.23572109585614293,"PASS",300000,5992,5992,0,0,0,0,39773,39773,0,0,0,0,79546,15661.4,15661.4,0,0,0,0,31322.81,26520,31322.81,48223.19,5.5E-2,2.5000000000000001E-2,3.8199999999999998E-2,3.2899999999999999E-2,1.25,0.8,0.25,7500,6628.83,2610.23,4018.6,1320.48,0,90000,79546,31322.81,48223.19,15845.8,0,7500,6628.83,2610.23,4018.6,1767.91,0,90000,79546,31322.81,48223.19,21214.9,0,3.04,0.17606444647275668,"PASS",2.27,0.23572109585614293,"PASS",300000,"Pass","Y","2021-07-05T16:36:30",null,"Case 54","Emily"]
[300000,3.3599999999999998E-2,5.8599999999999999E-2,30,0,300000,3.3599999999999998E-2,5.8599999999999999E-2,30,0,null,null,null,null,null,"Individual (Single)","Individual (Single)","","","","","","","","","","","","","","","","",45000,25000,0,0,0,0,0,0,0,0,0,0,0,0,0,0,0,0,0,0,0,0,0,0,0,0,0,0,0,0,0,0,0,0,0,0,0,0,0,0,0,0,100,100,100,100,100,100,500,10,100,500,300,100,100,0,0,0,0,5992,1594,0,0,0,0,39773,24051,0,0,0,0,63824,15661.4,13921.82,0,0,0,0,29583.23,26520,29583.23,34240.769999999997,5.5E-2,2.5000000000000001E-2,3.8199999999999998E-2,3.2899999999999999E-2,1.25,0.8,0.25,5833.33,5318.67,2465.27,2853.4,1323.8,0,70000,63824,29583.23,34240.769999999997,15885.59,0,5833.33,5318.67,2465.27,2853.4,1771.74,0,70000,63824,29583.23,34240.769999999997,21260.86,0,2.15,0.226936965201672,"PASS",1.61,0.30372656696365175,"PASS",300000,5992,1594,0,0,0,0,39773,24051,0,0,0,0,63824,15661.4,13921.82,0,0,0,0,29583.23,26520,29583.23,34240.769999999997,5.5E-2,2.5000000000000001E-2,3.8199999999999998E-2,3.2899999999999999E-2,1.25,0.8,0.25,5833.33,5318.67,2465.27,2853.4,1323.8,0,70000,63824,29583.23,34240.769999999997,15885.59,0,5833.33,5318.67,2465.27,2853.4,1771.74,0,70000,63824,29583.23,34240.769999999997,21260.86,0,2.15,0.226936965201672,"PASS",1.61,0.30372656696365175,"PASS",300000,"Pass","Y","2021-07-05T16:36:49",null,"Case 55","Emily"]
[1200000,4.7625000000000001E-2,7.2624999999999995E-2,30,3,500000,4.4999999999999998E-2,7.0000000000000007E-2,30,3,700000,null,7.4500000000000011E-2,20,0,"Individual (Single)","","","","","","","","","","","","","","","","","",100000,0,0,0,0,0,0,0,0,0,0,0,0,0,0,0,0,0,0,0,0,0,0,0,0,0,0,0,0,0,0,0,0,0,0,0,0,0,0,0,0,0,100,100,100,100,100,100,500,10,100,500,300,100,100,0,0,0,0,24967,0,0,0,0,0,75413,0,0,0,0,0,75413,23820.07,0,0,0,0,0,23820.07,26520,26520,48893,5.5E-2,2.5000000000000001E-2,3.8199999999999998E-2,3.2899999999999999E-2,1.25,0.8,0.25,8333.33,6284.42,2210,4074.42,5585.27,0,100000,75413,26520,48893,67023.23,0,8333.33,6284.42,2210,4074.42,8254.2900000000009,0,100000,75413,26520,48893,99051.43,0,0.72,0.67023229262921435,"FAIL",0.49,0.99051429756746057,"FAIL",636118.63,24967,0,0,0,0,0,75413,0,0,0,0,0,75413,23820.07,0,0,0,0,0,23820.07,26520,26520,48893,5.5E-2,2.5000000000000001E-2,3.8199999999999998E-2,3.2899999999999999E-2,1.25,0.8,0.25,8333.33,6284.42,2210,4074.42,5585.27,0,100000,75413,26520,48893,67023.23,0,8333.33,6284.42,2210,4074.42,8254.2900000000009,0,100000,75413,26520,48893,99051.43,0,0.72,0.67023229262921435,"FAIL",0.49,0.99051429756746057,"FAIL",636118.63,{"$f":"IF(AND(DS58=GB58,DT58=GC58,DU58=GD58,DV58=GE58,DW58=GF58,DX58=GG58,DY58=GH58,DZ58=GI58,EA58=GJ58,EB58=GK58,EC58=GL58,ED58=GM58,EE58=GN58,EF58=GO58,EG58=GP58,EH58=GQ58,EI58=GR58,EJ58=GS58,EK58=GT58,EL58=GU58,EM58=GV58,EN58=GW58,EO58=GX58,EP58=GY58,EQ58=GZ58,ER58=HA58,ES58=HB58,ET58=HC58,EU58=HD58,EV58=HE58,EW58=HF58),\"Pass\",\"Fail\")","v":"Pass"},"Y","2021-07-05T16:37:06",null,"Case 56","Emily"]
[1600000,3.0062499999999999E-2,5.50625E-2,30,5,1000000,3.2500000000000001E-2,5.7500000000000002E-2,30,5,600000,null,5.5E-2,30,0,"Individual (Single)","","","","","","","","","","","","","","","","","",100000,0,0,0,0,0,0,0,0,0,0,0,0,0,0,0,0,0,0,0,0,0,0,0,0,0,0,0,0,0,0,0,0,0,0,0,0,0,0,0,0,0,100,100,100,100,100,100,500,10,100,500,300,100,100,0,0,0,0,24967,0,0,0,0,0,75413,0,0,0,0,0,75413,23820.07,0,0,0,0,0,23820.07,26520,26520,48893,5.5E-2,2.5000000000000001E-2,3.8199999999999998E-2,3.2899999999999999E-2,1.25,0.8,0.25,8333.33,6284.42,2210,4074.42,6539.83,0,100000,75413,26520,48893,78477.95,0,8333.33,6284.42,2210,4074.42,9697.7999999999993,0,100000,75413,26520,48893,116373.58,0,0.62,0.784779470407998,"FAIL",0.42,1.1637357638770318,"FAIL",685466.29,24967,0,0,0,0,0,75413,0,0,0,0,0,75413,23820.07,0,0,0,0,0,23820.07,26520,26520,48893,5.5E-2,2.5000000000000001E-2,3.8199999999999998E-2,3.2899999999999999E-2,1.25,0.8,0.25,8333.33,6284.42,2210,4074.42,6539.83,0,100000,75413,26520,48893,78477.95,0,8333.33,6284.42,2210,4074.42,9697.7999999999993,0,100000,75413,26520,48893,116373.58,0,0.62,0.784779470407998,"FAIL",0.42,1.1637357638770318,"FAIL",685466.29,"Pass","Y","2021-07-05T16:37:23",null,"Case 57","Emily"]
[700000,5.1071428571428573E-2,7.6071428571428568E-2,35,0,250000,4.3999999999999997E-2,6.9000000000000006E-2,25,0,450000,null,0.08,35,0,"Individual (Single)","","","","","","","","","","","","","","","","","",100000,0,0,0,0,0,0,0,0,0,0,0,0,0,0,0,0,0,0,0,0,0,0,0,0,0,0,0,0,0,0,0,0,0,0,0,0,0,0,0,0,0,100,100,100,100,100,100,500,10,100,500,300,100,100,0,0,0,0,24967,0,0,0,0,0,75413,0,0,0,0,0,75413,23820.07,0,0,0,0,0,23820.07,26520,26520,48893,5.5E-2,2.5000000000000001E-2,3.8199999999999998E-2,3.2899999999999999E-2,1.25,0.8,0.25,8333.33,6284.42,2210,4074.42,2446.86,0,100000,75413,26520,48893,29362.29,0,8333.33,6284.42,2210,4074.42,4167.6099999999997,0,100000,75413,26520,48893,50011.26,0,1.66,0.29362294395318916,"PASS",0.97,0.50011261358632475,"FAIL",730439.71,24967,0,0,0,0,0,75413,0,0,0,0,0,75413,23820.07,0,0,0,0,0,23820.07,26520,26520,48893,5.5E-2,2.5000000000000001E-2,3.8199999999999998E-2,3.2899999999999999E-2,1.25,0.8,0.25,8333.33,6284.42,2210,4074.42,2446.86,0,100000,75413,26520,48893,29362.29,0,8333.33,6284.42,2210,4074.42,4167.6099999999997,0,100000,75413,26520,48893,50011.26,0,1.66,0.29362294395318916,"PASS",0.97,0.50011261358632475,"FAIL",730439.71,"Pass","Y","2021-07-05T16:37:39",null,"Case 58","Emily"]
[450000,4.8333333333333332E-2,7.3333333333333334E-2,40,5,150000,5.5E-2,0.08,40,0,300000,null,7.0000000000000007E-2,30,5,"Individual (Single)","","","","","","","","","","","","","","","","","",100000,0,0,0,0,0,0,0,0,0,0,0,0,0,0,0,0,0,0,0,0,0,0,0,0,0,0,0,0,0,0,0,0,0,0,0,0,0,0,0,0,0,100,100,100,100,100,100,500,10,100,500,300,100,100,0,0,0,0,24967,0,0,0,0,0,75413,0,0,0,0,0,75413,23820.07,0,0,0,0,0,23820.07,26520,26520,48893,5.5E-2,2.5000000000000001E-2,3.8199999999999998E-2,3.2899999999999999E-2,1.25,0.8,0.25,8333.33,6284.42,2210,4074.42,1773.66,0,100000,75413,26520,48893,21283.87,0,8333.33,6284.42,2210,4074.42,2885.23,0,100000,75413,26520,48893,34622.76,0,2.29,0.21283865063827959,"PASS",1.41,0.34622760138078118,"PASS",450000,24967,0,0,0,0,0,75413,0,0,0,0,0,75413,23820.07,0,0,0,0,0,23820.07,26520,26520,48893,5.5E-2,2.5000000000000001E-2,3.8199999999999998E-2,3.2899999999999999E-2,1.25,0.8,0.25,8333.33,6284.42,2210,4074.42,1773.66,0,100000,75413,26520,48893,21283.87,0,8333.33,6284.42,2210,4074.42,2885.23,0,100000,75413,26520,48893,34622.76,0,2.29,0.21283865063827959,"PASS",1.41,0.34622760138078118,"PASS",450000,"Pass","Y","2021-07-05T16:37:57",null,"Case 59","Emily"]
[2250000,3.0111111111111113E-2,5.5111111111111111E-2,30,5,2000000,2.9499999999999998E-2,5.5E-2,30,0,250000,null,6.0000000000000005E-2,30,5,"Individual (Single)","","","","","","","","","","","","","","","","","",100000,0,0,0,0,0,0,0,0,0,0,0,0,0,0,0,0,0,0,0,0,0,0,0,0,0,0,0,0,0,0,0,0,0,0,0,0,0,0,0,0,0,100,100,100,100,100,100,500,10,100,500,300,100,100,0,0,0,0,24967,0,0,0,0,0,75413,0,0,0,0,0,75413,23820.07,0,0,0,0,0,23820.07,26520,26520,48893,5.5E-2,2.5000000000000001E-2,3.8199999999999998E-2,3.2899999999999999E-2,1.25,0.8,0.25,8333.33,6284.42,2210,4074.42,9211.58,0,100000,75413,26520,48893,110538.93,0,8333.33,6284.42,2210,4074.42,12891,0,100000,75413,26520,48893,154691.99,0,0.44,1.1053892921027737,"FAIL",0.31,1.5469198509172482,"FAIL",712215.81,24967,0,0,0,0,0,75413,0,0,0,0,0,75413,23820.07,0,0,0,0,0,23820.07,26520,26520,48893,5.5E-2,2.5000000000000001E-2,3.8199999999999998E-2,3.2899999999999999E-2,1.25,0.8,0.25,8333.33,6284.42,2210,4074.42,9211.58,0,100000,75413,26520,48893,110538.93,0,8333.33,6284.42,2210,4074.42,12891,0,100000,75413,26520,48893,154691.99,0,0.44,1.1053892921027737,"FAIL",0.31,1.5469198509172482,"FAIL",712215.81,"Pass","Y","2021-07-05T16:38:14",null,"Case 60","Emily"]
[1850000,4.5783783783783782E-2,7.0783783783783777E-2,30,5,1100000,3.95E-2,6.4500000000000002E-2,30,5,750000,null,0.08,15,0,"Individual (Single)","","","","","","","","","","","","","","","","","",100000,0,0,0,0,0,0,0,0,0,0,0,0,0,0,0,0,0,0,0,0,0,0,0,0,0,0,0,0,0,0,0,0,0,0,0,0,0,0,0,0,0,100,100,100,100,100,100,500,10,100,500,300,100,100,0,0,0,0,24967,0,0,0,0,0,75413,0,0,0,0,0,75413,23820.07,0,0,0,0,0,23820.07,26520,26520,48893,5.5E-2,2.5000000000000001E-2,3.8199999999999998E-2,3.2899999999999999E-2,1.25,0.8,0.25,8333.33,6284.42,2210,4074.42,9942.5499999999993,0,100000,75413,26520,48893,119310.56,0,8333.33,6284.42,2210,4074.42,13521.07,0,100000,75413,26520,48893,162252.89000000001,0,0.4,1.1931055793818068,"FAIL",0.3,1.6225288592889031,"FAIL",607252.61,24967,0,0,0,0,0,75413,0,0,0,0,0,75413,23820.07,0,0,0,0,0,23820.07,26520,26520,48893,5.5E-2,2.5000000000000001E-2,3.8199999999999998E-2,3.2899999999999999E-2,1.25,0.8,0.25,8333.33,6284.42,2210,4074.42,9942.5499999999993,0,100000,75413,26520,48893,119310.56,0,8333.33,6284.42,2210,4074.42,13521.07,0,100000,75413,26520,48893,162252.89000000001,0,0.4,1.1931055793818068,"FAIL",0.3,1.6225288592889031,"FAIL",607252.61,"Pass","Y","2021-07-05T16:38:31",null,"Case 61","Emily"]
[489000,4.9911656441717793E-2,7.4911656441717794E-2,30,0,346000,5.5E-2,0.08,10,0,143000,null,6.2600000000000003E-2,30,0,"Individual (Single)","","","","","","","","","","","",2,"","","","","",55000,0,0,0,0,0,0,0,0,0,0,0,0,0,0,0,0,0,0,0,0,0,0,0,0,0,0,0,0,0,0,0,0,0,0,0,0,0,0,0,0,0,1,1,1,1,1,1,1,1,1,1,1,1,1,0,2000,0,0,9442,0,0,0,0,0,46263,0,0,0,0,0,46263,26779.15,0,0,0,0,0,26779.15,156,26779.15,19483.849999999999,5.5E-2,2.5000000000000001E-2,3.8199999999999998E-2,3.2899999999999999E-2,1.25,0.8,0.25,4583.33,3855.25,2231.6,1623.65,4152.2299999999996,76.400000000000006,55000,46263,26779.15,19483.849999999999,49826.78,916.8,4583.33,3855.25,2231.6,1623.65,5009.87,76.400000000000006,55000,46263,26779.15,19483.849999999999,60118.48,916.8,0.38,0.92261049592469579,"FAIL",0.31,1.1097322988992502,"FAIL",184689.65,9442,0,0,0,0,0,46263,0,0,0,0,0,46263,26779.15,0,0,0,0,0,26779.15,156,26779.15,19483.849999999999,5.5E-2,2.5000000000000001E-2,3.8199999999999998E-2,3.2899999999999999E-2,1.25,0.8,0.25,4583.33,3855.25,2231.6,1623.65,4152.2299999999996,76.400000000000006,55000,46263,26779.15,19483.849999999999,49826.78,916.8,4583.33,3855.25,2231.6,1623.65,5009.87,76.400000000000006,55000,46263,26779.15,19483.849999999999,60118.48,916.8,0.38,0.92261049592469579,"FAIL",0.31,1.1097322988992502,"FAIL",184689.65,"Pass","Y","2021-07-05T16:38:48",null,"Case 62","Emily"]
[355000,3.0394366197183099E-2,5.5394366197183104E-2,30,5,145000,4.3999999999999997E-2,6.9000000000000006E-2,25,5,210000,null,5.5E-2,30,0,"Individual (Single)","","","","","","","","","","","",2,"","","","","",55000,0,0,0,0,0,0,0,0,0,0,0,0,0,0,0,0,0,0,0,0,0,0,0,0,0,0,0,0,0,0,0,0,0,0,0,0,0,0,0,0,0,1,1,1,1,1,1,1,1,1,1,1,1,1,0,2000,0,0,9442,0,0,0,0,0,46263,0,0,0,0,0,46263,26779.15,0,0,0,0,0,26779.15,156,26779.15,19483.849999999999,5.5E-2,2.5000000000000001E-2,3.8199999999999998E-2,3.2899999999999999E-2,1.25,0.8,0.25,4583.33,3855.25,2231.6,1623.65,1492.87,76.400000000000006,55000,46263,26779.15,19483.849999999999,17914.400000000001,916.8,4583.33,3855.25,2231.6,1623.65,2307.85,76.400000000000006,55000,46263,26779.15,19483.849999999999,27694.240000000002,916.8,1.03,0.34238540492763758,"PASS",0.68,0.52020070150337205,"FAIL",256112.99,9442,0,0,0,0,0,46263,0,0,0,0,0,46263,26779.15,0,0,0,0,0,26779.15,156,26779.15,19483.849999999999,5.5E-2,2.5000000000000001E-2,3.8199999999999998E-2,3.2899999999999999E-2,1.25,0.8,0.25,4583.33,3855.25,2231.6,1623.65,1492.87,76.400000000000006,55000,46263,26779.15,19483.849999999999,17914.400000000001,916.8,4583.33,3855.25,2231.6,1623.65,2307.85,76.400000000000006,55000,46263,26779.15,19483.849999999999,27694.240000000002,916.8,1.03,0.34238540492763758,"PASS",0.68,0.52020070150337205,"FAIL",256112.99,"Pass","Y","2021-07-05T16:39:05",null,"Case 63","Emily"]

{"sheet":"CommercialTestCases","index":12,"n_rows":15,"n_cols":174,"rows_kept":15,"cut":false,"hidden":true,"merged":[[0,113,0,167],[0,0,0,57],[0,58,0,112]]}
["Test Cases TestCases TestCases TestCases TestCases TestCases TestCases TestCases TestCases TestCases TestCases TestCases TestCases TestCases TestCases TestCases TestCases TestCases TestCases TestCases TestCases TestCases TestCases TestCases TestCases TestCases TestCases TestCases TestCases  TestCases TestCases TestCases TestCases TestCases TestCases TestCases TestCases TestCases TestCases TestCases TestCases TestCases TestCases TestCases TestCases TestCases TestCases TestCases TestCases TestCases TestCases TestCases TestCases TestCases TestCases TestCases TestCases TestCases TestCases TestCases TestCases TestCases TestCases TestCases TestCases TestCases TestCases TestCases TestCases TestCases TestCases TestCases TestCases TestCases TestCases TestCases TestCases TestCases TestCases TestCases TestCases TestCases TestCases TestCases ",null,null,null,null,null,null,null,null,null,null,null,null,null,null,null,null,null,null,null,null,null,null,null,null,null,null,null,null,null,null,null,null,null,null,null,null,null,null,null,null,null,null,null,null,null,null,null,null,null,null,null,null,null,null,null,null,null,"Original-Result-set Original-Result-set Original-Result-set Original-Result-set Original-Result-set Original-Result-set Original-Result-set Original-Result-set Original-Result-set Original-Result-set Original-Result-set Original-Result-set Original-Result-set Original-Result-set Original-Result-set Original-Result-set Original-Result-set Original-Result-set Original-Result-set Original-Result-set Original-Result-set Original-Result-set Original-Result-set Original-Result-set Original-Result-set Original-Result-set Original-Result-set Original-Result-set Original-Result-set Original-Result-set Original-Result-set Original-Result-set Original-Result-set",null,null,null,null,null,null,null,null,null,null,null,null,null,null,null,null,null,null,null,null,null,null,null,null,null,null,null,null,null,null,null,null,null,null,null,null,null,null,null,null,null,null,null,null,null,null,null,null,null,null,null,null,null,null,"New-Resultset New-Resultset New-Resultset New-Resultset New-Resultset New-Resultset New-Resultset New-Resultset New-Resultset New-Resultset New-Resultset New-Resultset New-Resultset New-Resultset New-Resultset New-Resultset New-Resultset New-Resultset  New-Resultset  New-Resultset  New-Resultset  New-Resultset  New-Resultset  New-Resultset  New-Resultset New-Resultset New-Resultset",null,null,null,null,null,null,null,null,null,null,null,null,null,null,null,null,null,null,null,null,null,null,null,null,null,null,null,null,null,null,null,null,null,null,null,null,null,null,null,null,null,null,null,null,null,null,null,null,null,null,null,null,null,null,"Test cases will run when date tested is blank and Run Scenario Flag is \"Y\""]
["New Loan Amount","Interest Rate","Documentation Type","Loan Term (Years)","I/O Term (Years)","Loan Amount 1","Rate 1","Actual Loan Repayment (Monthly) 1","Loan Amount 2","Rate 2","Actual Loan Repayment (Monthly) 2","Loan Amount 3","Rate 3","Actual Loan Repayment (Monthly) 3","Loan Amount 4","Rate 4","Actual Loan Repayment (Monthly) 4","Net Profit Before Tax","Proposed Net CRE Rental Income","Proposed Gross Residential Rental Income","Depreciation","Ammortisation","Interest Paid","Directors Salaries/ Fees / Super","Other","Status Applicant 1","Status Applicant 2","Status Applicant 3","Status Applicant 4","Couple with  Applicant 1","Couple with  Applicant 2","Couple with  Applicant 3","Couple with  Applicant 4","Dependent Applicant 1","Dependent Applicant 2","Dependent Applicant 3","Dependent Applicant 4","Gross Annual Income Applicant 1","Gross Annual Income Applicant 2","Gross Annual Income Applicant 3","Gross Annual Income Applicant 4","Untaxed Allowable Income Applicant 1","Untaxed Allowable Income Applicant 2","Untaxed Allowable Income Applicant 3","Untaxed Allowable Income Applicant 4","Gross Residential Rental Income (Other) Applicant 1","Gross Residential Rental Income (Other) Applicant 2","Gross Residential Rental Income (Other) Applicant 3","Gross Residential Rental Income (Other) Applicant 4","Investment Property Loan Balance (personal name) Applicant 1","Investment Property Loan Balance (personal name) Applicant 2","Investment Property Loan Balance (personal name) Applicant 3","Investment Property Loan Balance (personal name) Applicant 4","Living Expenses Monthly (Declared Living Expenses)","Rent/Board","Total Credit Card Limit","Personal Mortgage Repayments","Other Consumer Debt","P&I Repayment","IO Repayment","Earning Before Interest, Tax, Depreciation & Ammortisation (EBITDA)"," Total Add Backs","Total Income Applicant 1","Total Income Applicant 2","Total Income Applicant 3","Total Income Applicant 4","Total Gross Annual Income of All Applicants","Tax Applicant 1","Tax Applicant 2","Tax Applicant 3","Tax Applicant 4","Tax offset for Low Income Earners Applicant 1","Tax offset for Low Income Earners Applicant 2","Tax offset for Low Income Earners Applicant 3","Tax offset for Low Income Earners Applicant 4","Total Net Annual Income Applicant 1","Total Net Annual Income Applicant 2","Total Net Annual Income Applicant 3","Total Net Annual Income Applicant 4","Total Net Annual Income of All Applicants","Total Taxable Income Applicant 1","Total Taxable Income Applicant 2","Total Taxable Income Applicant 3","Total Taxable Income Applicant 4","Total Taxable Income For All Applicants","Spouse Income Applicant 1","Spouse Income Applicant 2","Spouse Income Applicant 3","Spouse Income Applicant 4","Hem Living Expense Applicant 1","Hem Living Expense Applicant 2","Hem Living Expense Applicant 3","Hem Living Expense Applicant 4","Hem Living Expense Total","Customer Nominated Living Expenses","Used Living Expenses","Personal rent","Personal Debt","Baseline Assessment Rate","Assessment Loading","Credit Card Commitments","Workings for Negative Gearing","Other Mortgage Repayment Buffer","Rental Income Shading","Company Tax","Business income (EBITDA + net personal contribution)","Interest Expenses","Debt Repayments","Interest Coverage Ratio (ICR) %","Debt Service Coverage Ratio (DSCR) %","Interest Coverage Ratio (ICR) Flag","Debt Service Coverage Ratio (DSCR) Flag","Application Status Flag","P&I Repayment","IO Repayment","Earning Before Interest, Tax, Depreciation & Ammortisation (EBITDA)"," Total Add Backs","Total Income Applicant 1","Total Income Applicant 2","Total Income Applicant 3","Total Income Applicant 4","Total Gross Annual Income of All Applicants","Tax Applicant 1","Tax Applicant 2","Tax Applicant 3","Tax Applicant 4","Tax offset for Low Income Earners Applicant 1","Tax offset for Low Income Earners Applicant 2","Tax offset for Low Income Earners Applicant 3","Tax offset for Low Income Earners Applicant 4","Total Net Annual Income Applicant 1","Total Net Annual Income Applicant 2","Total Net Annual Income Applicant 3","Total Net Annual Income Applicant 4","Total Net Annual Income of All Applicants","Total Taxable Income Applicant 1","Total Taxable Income Applicant 2","Total Taxable Income Applicant 3","Total Taxable Income Applicant 4","Total Taxable Income For All Applicants","Spouse Income Applicant 1","Spouse Income Applicant 2","Spouse Income Applicant 3","Spouse Income Applicant 4","Hem Living Expense Applicant 1","Hem Living Expense Applicant 2","Hem Living Expense Applicant 3","Hem Living Expense Applicant 4","Hem Living Expense Total","Customer Nominated Living Expenses","Used Living Expenses","Personal rent","Personal Debt","Baseline Assessment Rate","Assessment Loading","Credit Card Commitments","Workings for Negative Gearing","Other Mortgage Repayment Buffer","Rental Income Shading","Company Tax","Business income (EBITDA + net personal contribution)","Interest Expenses","Debt Repayments","Interest Coverage Ratio (ICR) %","Debt Service Coverage Ratio (DSCR) %","Interest Coverage Ratio (ICR) Flag","Debt Service Coverage Ratio (DSCR) Flag","Application Status Flag","Pass or Fail","Run Scenario Flag","Date Tested","Scenario","Sequence","Name "]
[1000000,0.05,"Full Doc",12,0,0,0,0,0,0,0,0,0,0,0,0,0,50000,70000,0,0,0,0,0,0,0,0,0,0,0,0,0,0,0,0,0,0,0,0,0,0,0,0,0,0,0,0,0,0,0,0,0,0,0,0,0,0,0,9248.9,0,120000,0,0,0,0,0,0,0,0,0,0,0,0,0,0,0,0,0,0,0,0,0,0,0,0,0,0,0,0,0,0,0,0,0,0,0,0,0,5.5E-2,2.5000000000000001E-2,3.8199999999999998E-2,3.2899999999999999E-2,1.25,0.8,0.25,120000,50000,110986.85,2.4,1.081209173895795,"PASS","FAIL","COMPLETE",9248.9,0,120000,0,0,0,0,0,0,0,0,0,0,0,0,0,0,0,0,0,0,0,0,0,0,0,0,0,0,0,0,0,0,0,0,0,0,0,0,0,5.5E-2,2.5000000000000001E-2,3.8199999999999998E-2,3.2899999999999999E-2,1.25,0.8,0.25,120000,50000,110986.85,2.4,1.081209173895795,"PASS","FAIL","COMPLETE",{"$f":"IF(AND(CC3=EF3,CD3=EG3,CE3=EH3,CF3=EI3,CG3=EJ3,CH3=EK3,CI3=EL3,CJ3=EM3,CK3=EN3,CL3=EO3,CM3=EP3,CN3=EQ3,CO3=ER3,CP3=ES3,CQ3=ET3,CR3=EU3,CS3=EV3,CT3=EW3,CU3=EX3,CV3=EY3,CW3=EZ3,CX3=FA3,CY3=FB3,CZ3=FC3,DA3=FD3,DB3=FE3,DC3=FF3,DD3=FG3,DE3=FH3,DF3=FI3,DG3=FJ3,DH3=FK3,DI3=FL3),\"Pass\",\"Fail\")","v":"Pass"},"Y","2021-07-28T09:28:11",null,"Case 1","Emily"]
[1000000,0.05,"Full Doc",15,3,0,0,0,0,0,0,0,0,0,0,0,0,50000,70000,0,0,0,0,0,0,"Individual (Couple)",0,0,0,"N/A",0,0,0,2,0,0,0,30000,0,0,0,0,0,0,0,0,0,0,0,0,0,0,0,2000,0,10000,0,1000,9248.9,4166.67,120000,0,30000,0,0,0,30000,2842,0,0,0,-645,0,0,0,27803,0,0,0,27803,30000,0,0,0,30000,0,0,0,0,32354.91,0,0,0,32354.91,24000,32354.91,0,16584,5.5E-2,2.5000000000000001E-2,3.8199999999999998E-2,3.2899999999999999E-2,1.25,0.8,0.25,98864.09,50000,110986.85,1.9772817341733624,0.89077297931867749,"PASS","FAIL","COMPLETE",9248.9,4166.67,120000,0,30000,0,0,0,30000,2842,0,0,0,-645,0,0,0,27803,0,0,0,27803,30000,0,0,0,30000,0,0,0,0,32354.91,0,0,0,32354.91,24000,32354.91,0,16584,5.5E-2,2.5000000000000001E-2,3.8199999999999998E-2,3.2899999999999999E-2,1.25,0.8,0.25,98864.09,50000,110986.85,1.9772817341733624,0.89077297931867749,"PASS","FAIL","COMPLETE","Pass","Y","2021-07-28T09:28:17",null,"Case 2","Emily"]
[1000000,0.05,"Full Doc",15,3,0,0,0,0,0,0,0,0,0,0,0,0,50000,70000,80000,0,0,0,0,0,"Individual (Couple)",0,0,0,"N/A",0,0,0,2,0,0,0,30000,0,0,0,0,0,0,0,0,0,0,0,0,0,0,0,4000,0,10000,0,1000,9248.9,4166.67,184000,0,30000,0,0,0,30000,2842,0,0,0,-645,0,0,0,27803,0,0,0,27803,30000,0,0,0,30000,0,0,0,0,32354.91,0,0,0,32354.91,48000,48000,0,16584,5.5E-2,2.5000000000000001E-2,3.8199999999999998E-2,3.2899999999999999E-2,1.25,0.8,0.25,147219,50000,110986.85,2.9443800000000002,1.3264544447647086,"PASS","PASS","COMPLETE",9248.9,4166.67,184000,0,30000,0,0,0,30000,2842,0,0,0,-645,0,0,0,27803,0,0,0,27803,30000,0,0,0,30000,0,0,0,0,32354.91,0,0,0,32354.91,48000,48000,0,16584,5.5E-2,2.5000000000000001E-2,3.8199999999999998E-2,3.2899999999999999E-2,1.25,0.8,0.25,147219,50000,110986.85,2.9443800000000002,1.3264544447647086,"PASS","PASS","COMPLETE","Pass","Y","2021-07-28T09:28:22",null,"Case 3","Emily"]
[1000000,0.05,"Alt Doc",12,0,0,0,0,0,0,0,0,0,0,0,0,0,50000,70000,0,0,0,0,0,0,0,0,0,0,0,0,0,0,0,0,0,0,0,0,0,0,0,0,0,0,0,0,0,0,0,0,0,0,0,0,0,0,0,9248.9,0,120000,0,0,0,0,0,0,0,0,0,0,0,0,0,0,0,0,0,0,0,0,0,0,0,0,0,0,0,0,0,0,0,0,0,0,0,0,0,5.5E-2,2.5000000000000001E-2,3.8199999999999998E-2,3.2899999999999999E-2,1.25,0.8,0.25,120000,50000,110986.85,2.4,1.081209173895795,"PASS","FAIL","COMPLETE",9248.9,0,120000,0,0,0,0,0,0,0,0,0,0,0,0,0,0,0,0,0,0,0,0,0,0,0,0,0,0,0,0,0,0,0,0,0,0,0,0,0,5.5E-2,2.5000000000000001E-2,3.8199999999999998E-2,3.2899999999999999E-2,1.25,0.8,0.25,120000,50000,110986.85,2.4,1.081209173895795,"PASS","FAIL","COMPLETE","Pass","Y","2021-07-28T09:28:27",null,"Case 4","Emily"]
[1000000,0.05,"Alt Doc",15,3,0,0,0,0,0,0,0,0,0,0,0,0,50000,70000,0,0,0,0,0,0,"Individual (Couple)",0,0,0,"N/A",0,0,0,2,0,0,0,30000,0,0,0,0,0,0,0,0,0,0,0,0,0,0,0,2000,0,10000,0,1000,9248.9,4166.67,120000,0,30000,0,0,0,30000,2842,0,0,0,-645,0,0,0,27803,0,0,0,27803,30000,0,0,0,30000,0,0,0,0,32354.91,0,0,0,32354.91,24000,32354.91,0,16584,5.5E-2,2.5000000000000001E-2,3.8199999999999998E-2,3.2899999999999999E-2,1.25,0.8,0.25,98864.09,50000,110986.85,1.9772817341733624,0.89077297931867749,"PASS","FAIL","COMPLETE",9248.9,4166.67,120000,0,30000,0,0,0,30000,2842,0,0,0,-645,0,0,0,27803,0,0,0,27803,30000,0,0,0,30000,0,0,0,0,32354.91,0,0,0,32354.91,24000,32354.91,0,16584,5.5E-2,2.5000000000000001E-2,3.8199999999999998E-2,3.2899999999999999E-2,1.25,0.8,0.25,98864.09,50000,110986.85,1.9772817341733624,0.89077297931867749,"PASS","FAIL","COMPLETE","Pass","Y","2021-07-28T09:28:31",null,"Case 5","Emily"]
[830000,9.8470000000000002E-2,"Full Doc",15,3,0,0,0,0,0,0,0,0,0,0,0,0,50000,70000,80000,0,0,0,0,0,"Individual (Couple)",0,0,0,"N/A",0,0,0,2,0,0,0,30000,0,0,0,0,0,0,0,0,0,0,0,0,0,0,0,4000,0,10000,0,1000,9845.93,6810.84,184000,0,30000,0,0,0,30000,2842,0,0,0,-645,0,0,0,27803,0,0,0,27803,30000,0,0,0,30000,0,0,0,0,32354.91,0,0,0,32354.91,48000,48000,0,16584,5.5E-2,2.5000000000000001E-2,3.8199999999999998E-2,3.2899999999999999E-2,1.25,0.8,0.25,147219,81730.100000000006,118151.13,1.8012825140309383,1.246022771740553,"PASS","PASS","COMPLETE",9845.93,6810.84,184000,0,30000,0,0,0,30000,2842,0,0,0,-645,0,0,0,27803,0,0,0,27803,30000,0,0,0,30000,0,0,0,0,32354.91,0,0,0,32354.91,48000,48000,0,16584,5.5E-2,2.5000000000000001E-2,3.8199999999999998E-2,3.2899999999999999E-2,1.25,0.8,0.25,147219,81730.100000000006,118151.13,1.8012825140309383,1.246022771740553,"PASS","PASS","COMPLETE","Pass","Y","2021-07-28T09:28:36",null,"Case 6","Emily"]
[832000,9.8470000000000002E-2,"Full Doc",15,3,0,0,0,0,0,0,0,0,0,0,0,0,50000,70000,80000,0,0,0,0,0,"Individual (Couple)",0,0,0,"N/A",0,0,0,2,0,0,0,30000,0,0,0,0,0,0,0,0,0,0,0,0,0,0,0,4000,0,10000,0,1000,9869.65,6827.25,184000,0,30000,0,0,0,30000,2842,0,0,0,-645,0,0,0,27803,0,0,0,27803,30000,0,0,0,30000,0,0,0,0,32354.91,0,0,0,32354.91,48000,48000,0,16584,5.5E-2,2.5000000000000001E-2,3.8199999999999998E-2,3.2899999999999999E-2,1.25,0.8,0.25,147219,81927.039999999994,118435.83,1.7969525079875945,1.2430275246930997,"PASS","FAIL","COMPLETE",9869.65,6827.25,184000,0,30000,0,0,0,30000,2842,0,0,0,-645,0,0,0,27803,0,0,0,27803,30000,0,0,0,30000,0,0,0,0,32354.91,0,0,0,32354.91,48000,48000,0,16584,5.5E-2,2.5000000000000001E-2,3.8199999999999998E-2,3.2899999999999999E-2,1.25,0.8,0.25,147219,81927.039999999994,118435.83,1.7969525079875945,1.2430275246930997,"PASS","FAIL","COMPLETE","Pass","Y","2021-07-28T09:28:41",null,"Case 7","Emily"]
[1000000,9.8470000000000002E-2,"Full Doc",15,3,0,0,0,0,0,0,0,0,0,0,0,0,50000,70000,80000,0,0,0,0,0,"Individual (Couple)",0,0,0,"N/A",0,0,0,2,0,0,0,30000,0,0,0,0,0,0,0,0,0,0,0,0,0,0,0,4000,0,10000,0,1000,11862.56,8205.83,184000,0,30000,0,0,0,30000,2842,0,0,0,-645,0,0,0,27803,0,0,0,27803,30000,0,0,0,30000,0,0,0,0,32354.91,0,0,0,32354.91,48000,48000,0,16584,5.5E-2,2.5000000000000001E-2,3.8199999999999998E-2,3.2899999999999999E-2,1.25,0.8,0.25,147219,98470,142350.76,1.4950644866456788,1.0341989005446588,"PASS","FAIL","COMPLETE",11862.56,8205.83,184000,0,30000,0,0,0,30000,2842,0,0,0,-645,0,0,0,27803,0,0,0,27803,30000,0,0,0,30000,0,0,0,0,32354.91,0,0,0,32354.91,48000,48000,0,16584,5.5E-2,2.5000000000000001E-2,3.8199999999999998E-2,3.2899999999999999E-2,1.25,0.8,0.25,147219,98470,142350.76,1.4950644866456788,1.0341989005446588,"PASS","FAIL","COMPLETE","Pass","Y","2021-07-28T09:28:45",null,"Case 8","Emily"]
[1000000,9.8479999999999998E-2,"Full Doc",15,3,0,0,0,0,0,0,0,0,0,0,0,0,50000,70000,80000,0,0,0,0,0,"Individual (Couple)",0,0,0,"N/A",0,0,0,2,0,0,0,30000,0,0,0,0,0,0,0,0,0,0,0,0,0,0,0,4000,0,10000,0,1000,11863.14,8206.67,184000,0,30000,0,0,0,30000,2842,0,0,0,-645,0,0,0,27803,0,0,0,27803,30000,0,0,0,30000,0,0,0,0,32354.91,0,0,0,32354.91,48000,48000,0,16584,5.5E-2,2.5000000000000001E-2,3.8199999999999998E-2,3.2899999999999999E-2,1.25,0.8,0.25,147219,98480,142357.67000000001,1.4949126726238831,1.0341487293022722,"FAIL","FAIL","COMPLETE",11863.14,8206.67,184000,0,30000,0,0,0,30000,2842,0,0,0,-645,0,0,0,27803,0,0,0,27803,30000,0,0,0,30000,0,0,0,0,32354.91,0,0,0,32354.91,48000,48000,0,16584,5.5E-2,2.5000000000000001E-2,3.8199999999999998E-2,3.2899999999999999E-2,1.25,0.8,0.25,147219,98480,142357.67000000001,1.4949126726238831,1.0341487293022722,"FAIL","FAIL","COMPLETE","Pass","Y","2021-07-28T09:28:50",null,"Case 9","Emily"]
[1000000,8.4400000000000003E-2,"Alt Doc",15,3,0,0,0,0,0,0,0,0,0,0,0,0,50000,70000,80000,0,0,0,0,0,"Individual (Couple)",0,0,0,"N/A",0,0,0,2,0,0,0,30000,0,0,0,0,0,0,0,0,0,0,0,0,0,0,0,4000,0,10000,0,1000,11067.23,7033.33,184000,0,30000,0,0,0,30000,2842,0,0,0,-645,0,0,0,27803,0,0,0,27803,30000,0,0,0,30000,0,0,0,0,32354.91,0,0,0,32354.91,48000,48000,0,16584,5.5E-2,2.5000000000000001E-2,3.8199999999999998E-2,3.2899999999999999E-2,1.25,0.8,0.25,147219,84400,132806.82,1.7443009478672986,1.108519913348835,"FAIL","FAIL","COMPLETE",11067.23,7033.33,184000,0,30000,0,0,0,30000,2842,0,0,0,-645,0,0,0,27803,0,0,0,27803,30000,0,0,0,30000,0,0,0,0,32354.91,0,0,0,32354.91,48000,48000,0,16584,5.5E-2,2.5000000000000001E-2,3.8199999999999998E-2,3.2899999999999999E-2,1.25,0.8,0.25,147219,84400,132806.82,1.7443009478672986,1.108519913348835,"FAIL","FAIL","COMPLETE","Pass","Y","2021-07-28T09:28:56",null,"Case 10","Emily"]
[1000000,8.43E-2,"Alt Doc",15,3,0,0,0,0,0,0,0,0,0,0,0,0,50000,70000,80000,0,0,0,0,0,"Individual (Couple)",0,0,0,"N/A",0,0,0,2,0,0,0,30000,0,0,0,0,0,0,0,0,0,0,0,0,0,0,0,4000,0,10000,0,1000,11061.69,7025,184000,0,30000,0,0,0,30000,2842,0,0,0,-645,0,0,0,27803,0,0,0,27803,30000,0,0,0,30000,0,0,0,0,32354.91,0,0,0,32354.91,48000,48000,0,16584,5.5E-2,2.5000000000000001E-2,3.8199999999999998E-2,3.2899999999999999E-2,1.25,0.8,0.25,147219,84300,132740.24,1.7463701067615658,1.1090759209102476,"PASS","FAIL","COMPLETE",11061.69,7025,184000,0,30000,0,0,0,30000,2842,0,0,0,-645,0,0,0,27803,0,0,0,27803,30000,0,0,0,30000,0,0,0,0,32354.91,0,0,0,32354.91,48000,48000,0,16584,5.5E-2,2.5000000000000001E-2,3.8199999999999998E-2,3.2899999999999999E-2,1.25,0.8,0.25,147219,84300,132740.24,1.7463701067615658,1.1090759209102476,"PASS","FAIL","COMPLETE","Pass","Y","2021-07-28T09:29:01",null,"Case 11","Emily"]
[1000000,0.05,"Full Doc",15,3,0,0,0,0,0,0,0,0,0,0,0,0,50000,70000,0,0,0,0,0,0,"Individual (Couple)",0,0,0,"N/A",0,0,0,2,0,0,0,55000,0,0,0,0,0,0,0,0,0,0,0,0,0,0,0,2000,0,10000,0,1000,9248.9,4166.67,120000,0,55000,0,0,0,55000,9442,0,0,0,-705,0,0,0,46263,0,0,0,46263,55000,0,0,0,55000,0,0,0,0,35831.46,0,0,0,35831.46,24000,35831.46,0,16584,5.5E-2,2.5000000000000001E-2,3.8199999999999998E-2,3.2899999999999999E-2,1.25,0.8,0.25,113847.54,50000,110986.85,2.2769508933541371,1.0257750810019661,"PASS","FAIL","COMPLETE",9248.9,4166.67,120000,0,55000,0,0,0,55000,9442,0,0,0,-705,0,0,0,46263,0,0,0,46263,55000,0,0,0,55000,0,0,0,0,35831.46,0,0,0,35831.46,24000,35831.46,0,16584,5.5E-2,2.5000000000000001E-2,3.8199999999999998E-2,3.2899999999999999E-2,1.25,0.8,0.25,113847.54,50000,110986.85,2.2769508933541371,1.0257750810019661,"PASS","FAIL","COMPLETE","Pass","Y","2021-07-28T09:29:06",null,"Case 12","Emily"]
[1000000,0.05,"Full Doc",15,3,0,0,0,0,0,0,0,0,0,0,0,0,50000,70000,0,0,0,0,0,0,"Individual (Couple)","Individual (Single)",0,0,"N/A",0,0,0,2,0,0,0,55000,100000,0,0,0,0,0,0,0,0,0,0,0,0,0,0,2000,0,10000,0,1000,9248.9,4166.67,120000,0,55000,100000,0,0,155000,9442,24967,0,0,-705,-380,0,0,46263,75413,0,0,121676,55000,100000,0,0,155000,0,0,0,0,35831.46,23820.07,0,0,59651.53,24000,59651.53,0,16584,5.5E-2,2.5000000000000001E-2,3.8199999999999998E-2,3.2899999999999999E-2,1.25,0.8,0.25,165440.47,50000,110986.85,3.3088094205452303,1.4906312917359719,"PASS","PASS","COMPLETE",9248.9,4166.67,120000,0,55000,100000,0,0,155000,9442,24967,0,0,-705,-380,0,0,46263,75413,0,0,121676,55000,100000,0,0,155000,0,0,0,0,35831.46,23820.07,0,0,59651.53,24000,59651.53,0,16584,5.5E-2,2.5000000000000001E-2,3.8199999999999998E-2,3.2899999999999999E-2,1.25,0.8,0.25,165440.47,50000,110986.85,3.3088094205452303,1.4906312917359719,"PASS","PASS","COMPLETE","Pass","Y","2021-07-28T09:29:12",null,"Case 13","Emily"]

{"sheet":"CommercialTestCasesBetterChoice","index":13,"n_rows":19,"n_cols":179,"rows_kept":19,"cut":false,"hidden":true,"merged":[[0,0,0,57],[0,58,0,112],[0,113,0,167]]}
["Test Cases TestCases TestCases TestCases TestCases TestCases TestCases TestCases TestCases TestCases TestCases TestCases TestCases TestCases TestCases TestCases TestCases TestCases TestCases TestCases TestCases TestCases TestCases TestCases TestCases TestCases TestCases TestCases TestCases  TestCases TestCases TestCases TestCases TestCases TestCases TestCases TestCases TestCases TestCases TestCases TestCases TestCases TestCases TestCases TestCases TestCases TestCases TestCases TestCases TestCases TestCases TestCases TestCases TestCases TestCases TestCases TestCases TestCases TestCases TestCases TestCases TestCases TestCases TestCases TestCases TestCases TestCases TestCases TestCases TestCases TestCases TestCases TestCases TestCases TestCases TestCases TestCases TestCases TestCases TestCases TestCases TestCases TestCases TestCases ",null,null,null,null,null,null,null,null,null,null,null,null,null,null,null,null,null,null,null,null,null,null,null,null,null,null,null,null,null,null,null,null,null,null,null,null,null,null,null,null,null,null,null,null,null,null,null,null,null,null,null,null,null,null,null,null,null,"Original-Result-set Original-Result-set Original-Result-set Original-Result-set Original-Result-set Original-Result-set Original-Result-set Original-Result-set Original-Result-set Original-Result-set Original-Result-set Original-Result-set Original-Result-set Original-Result-set Original-Result-set Original-Result-set Original-Result-set Original-Result-set Original-Result-set Original-Result-set Original-Result-set Original-Result-set Original-Result-set Original-Result-set Original-Result-set Original-Result-set Original-Result-set Original-Result-set Original-Result-set Original-Result-set Original-Result-set Original-Result-set Original-Result-set",null,null,null,null,null,null,null,null,null,null,null,null,null,null,null,null,null,null,null,null,null,null,null,null,null,null,null,null,null,null,null,null,null,null,null,null,null,null,null,null,null,null,null,null,null,null,null,null,null,null,null,null,null,null,"New-Resultset New-Resultset New-Resultset New-Resultset New-Resultset New-Resultset New-Resultset New-Resultset New-Resultset New-Resultset New-Resultset New-Resultset New-Resultset New-Resultset New-Resultset New-Resultset New-Resultset New-Resultset  New-Resultset  New-Resultset  New-Resultset  New-Resultset  New-Resultset  New-Resultset  New-Resultset New-Resultset New-Resultset",null,null,null,null,null,null,null,null,null,null,null,null,null,null,null,null,null,null,null,null,null,null,null,null,null,null,null,null,null,null,null,null,null,null,null,null,null,null,null,null,null,null,null,null,null,null,null,null,null,null,null,null,null,null,"Test cases will run when date tested is blank and Run Scenario Flag is \"Y\""]
["New Loan Amount","Interest Rate","Documentation Type","Loan Term (Years)","I/O Term (Years)","Loan Amount 1","Rate 1","Actual Loan Repayment (Monthly) 1","Loan Amount 2","Rate 2","Actual Loan Repayment (Monthly) 2","Loan Amount 3","Rate 3","Actual Loan Repayment (Monthly) 3","Loan Amount 4","Rate 4","Actual Loan Repayment (Monthly) 4","Net Profit Before Tax","Proposed Net CRE Rental Income","Proposed Gross Residential Rental Income","Depreciation","Ammortisation","Interest Paid","Directors Salaries/ Fees / Super","Other","Status Applicant 1","Status Applicant 2","Status Applicant 3","Status Applicant 4","Couple with  Applicant 1","Couple with  Applicant 2","Couple with  Applicant 3","Couple with  Applicant 4","Dependent Applicant 1","Dependent Applicant 2","Dependent Applicant 3","Dependent Applicant 4","Gross Annual Income Applicant 1","Gross Annual Income Applicant 2","Gross Annual Income Applicant 3","Gross Annual Income Applicant 4","Untaxed Allowable Income Applicant 1","Untaxed Allowable Income Applicant 2","Untaxed Allowable Income Applicant 3","Untaxed Allowable Income Applicant 4","Gross Residential Rental Income (Other) Applicant 1","Gross Residential Rental Income (Other) Applicant 2","Gross Residential Rental Income (Other) Applicant 3","Gross Residential Rental Income (Other) Applicant 4","Investment Property Loan Balance (personal name) Applicant 1","Investment Property Loan Balance (personal name) Applicant 2","Investment Property Loan Balance (personal name) Applicant 3","Investment Property Loan Balance (personal name) Applicant 4","Living Expenses Monthly (Declared Living Expenses)","Rent/Board","Total Credit Card Limit","Personal Mortgage Repayments","Other Consumer Debt","P&I Repayment","IO Repayment","Earning Before Interest, Tax, Depreciation & Ammortisation (EBITDA)"," Total Add Backs","Total Income Applicant 1","Total Income Applicant 2","Total Income Applicant 3","Total Income Applicant 4","Total Gross Annual Income of All Applicants","Tax Applicant 1","Tax Applicant 2","Tax Applicant 3","Tax Applicant 4","Tax offset for Low Income Earners Applicant 1","Tax offset for Low Income Earners Applicant 2","Tax offset for Low Income Earners Applicant 3","Tax offset for Low Income Earners Applicant 4","Total Net Annual Income Applicant 1","Total Net Annual Income Applicant 2","Total Net Annual Income Applicant 3","Total Net Annual Income Applicant 4","Total Net Annual Income of All Applicants","Total Taxable Income Applicant 1","Total Taxable Income Applicant 2","Total Taxable Income Applicant 3","Total Taxable Income Applicant 4","Total Taxable Income For All Applicants","Spouse Income Applicant 1","Spouse Income Applicant 2","Spouse Income Applicant 3","Spouse Income Applicant 4","Hem Living Expense Applicant 1","Hem Living Expense Applicant 2","Hem Living Expense Applicant 3","Hem Living Expense Applicant 4","Hem Living Expense Total","Customer Nominated Living Expenses","Used Living Expenses","Personal rent","Personal Debt","Baseline Assessment Rate","Assessment Loading","Credit Card Commitments","Workings for Negative Gearing","Other Mortgage Repayment Buffer","Rental Income Shading","Company Tax","Business income (EBITDA + net personal contribution)","Interest Expenses","Debt Repayments","Interest Coverage Ratio (ICR) %","Debt Service Coverage Ratio (DSCR) %","Interest Coverage Ratio (ICR) Flag","Debt Service Coverage Ratio (DSCR) Flag","Application Status Flag","P&I Repayment","IO Repayment","Earning Before Interest, Tax, Depreciation & Ammortisation (EBITDA)"," Total Add Backs","Total Income Applicant 1","Total Income Applicant 2","Total Income Applicant 3","Total Income Applicant 4","Total Gross Annual Income of All Applicants","Tax Applicant 1","Tax Applicant 2","Tax Applicant 3","Tax Applicant 4","Tax offset for Low Income Earners Applicant 1","Tax offset for Low Income Earners Applicant 2","Tax offset for Low Income Earners Applicant 3","Tax offset for Low Income Earners Applicant 4","Total Net Annual Income Applicant 1","Total Net Annual Income Applicant 2","Total Net Annual Income Applicant 3","Total Net Annual Income Applicant 4","Total Net Annual Income of All Applicants","Total Taxable Income Applicant 1","Total Taxable Income Applicant 2","Total Taxable Income Applicant 3","Total Taxable Income Applicant 4","Total Taxable Income For All Applicants","Spouse Income Applicant 1","Spouse Income Applicant 2","Spouse Income Applicant 3","Spouse Income Applicant 4","Hem Living Expense Applicant 1","Hem Living Expense Applicant 2","Hem Living Expense Applicant 3","Hem Living Expense Applicant 4","Hem Living Expense Total","Customer Nominated Living Expenses","Used Living Expenses","Personal rent","Personal Debt","Baseline Assessment Rate","Assessment Loading","Credit Card Commitments","Workings for Negative Gearing","Other Mortgage Repayment Buffer","Rental Income Shading","Company Tax","Business income (EBITDA + net personal contribution)","Interest Expenses","Debt Repayments","Interest Coverage Ratio (ICR) %","Debt Service Coverage Ratio (DSCR) %","Interest Coverage Ratio (ICR) Flag","Debt Service Coverage Ratio (DSCR) Flag","Application Status Flag","Pass or Fail","Run Scenario Flag","Date Tested","Scenario","Sequence","Name ",null,null,"Debt Service Coverage Ratio (DSCR) Flag New Version","Debt Service Coverage Ratio (DSCR) %","Text Outcome for DSCR"]
[1000000,0.05,"Full Doc",12,0,0,0,0,0,0,0,0,0,0,0,0,0,50000,70000,0,0,0,0,0,0,0,0,0,0,0,0,0,0,0,0,0,0,0,0,0,0,0,0,0,0,0,0,0,0,0,0,0,0,0,0,0,0,0,9248.9,0,120000,0,0,0,0,0,0,0,0,0,0,0,0,0,0,0,0,0,0,0,0,0,0,0,0,0,0,0,0,0,0,0,0,0,0,0,0,0,5.5E-2,2.5000000000000001E-2,3.8199999999999998E-2,3.6700000000000003E-2,1.25,0.8,0.26,120000,50000,110986.85,2.4,1.081209173895795,"PASS","FAIL","COMPLETE",9248.9,0,120000,0,0,0,0,0,0,0,0,0,0,0,0,0,0,0,0,0,0,0,0,0,0,0,0,0,0,0,0,0,0,0,0,0,0,0,0,0,5.5E-2,2.5000000000000001E-2,3.8199999999999998E-2,3.6700000000000003E-2,1.25,0.8,0.26,120000,50000,110986.85,2.4,1.081209173895795,"PASS","FAIL","COMPLETE",{"$f":"IF(AND(CC3=EF3,CD3=EG3,CE3=EH3,CF3=EI3,CG3=EJ3,CH3=EK3,CI3=EL3,CJ3=EM3,CK3=EN3,CL3=EO3,CM3=EP3,CN3=EQ3,CO3=ER3,CP3=ES3,CQ3=ET3,CR3=EU3,CS3=EV3,CT3=EW3,CU3=EX3,CV3=EY3,CW3=EZ3,CX3=FA3,CY3=FB3,CZ3=FC3,DA3=FD3,DB3=FE3,DC3=FF3,DD3=FG3,DE3=FH3,DF3=FI3,DG3=FJ3,DH3=FK3,DI3=FL3),\"Pass\",\"Fail\")","v":"Pass"},"Y","2020-11-16T11:27:22",null,"Case 1","Neil",null,null,"FAIL",1.081209173895795,"Correct"]
[1000000,0.05,"Full Doc",15,3,0,0,0,0,0,0,0,0,0,0,0,0,50000,70000,0,0,0,0,0,0,"Individual (Couple)",0,0,0,"N/A",0,0,0,2,0,0,0,30000,0,0,0,0,0,0,0,0,0,0,0,0,0,0,0,2000,0,10000,0,1000,9248.9,4166.67,120000,0,30000,0,0,0,30000,2842,0,0,0,-645,0,0,0,27803,0,0,0,27803,30000,0,0,0,30000,0,0,0,0,32997.199999999997,0,0,0,32997.199999999997,24000,32997.199999999997,0,16584,5.5E-2,2.5000000000000001E-2,3.8199999999999998E-2,3.6700000000000003E-2,1.25,0.8,0.26,98221.8,50000,110986.85,1.9644359176182054,0.88498588985800319,"PASS","FAIL","COMPLETE",9248.9,4166.67,120000,0,30000,0,0,0,30000,2842,0,0,0,-645,0,0,0,27803,0,0,0,27803,30000,0,0,0,30000,0,0,0,0,32997.199999999997,0,0,0,32997.199999999997,24000,32997.199999999997,0,16584,5.5E-2,2.5000000000000001E-2,3.8199999999999998E-2,3.6700000000000003E-2,1.25,0.8,0.26,98221.8,50000,110986.85,1.9644359176182054,0.88498588985800319,"PASS","FAIL","COMPLETE",{"$f":"IF(AND(CC4=EF4,CD4=EG4,CE4=EH4,CF4=EI4,CG4=EJ4,CH4=EK4,CI4=EL4,CJ4=EM4,CK4=EN4,CL4=EO4,CM4=EP4,CN4=EQ4,CO4=ER4,CP4=ES4,CQ4=ET4,CR4=EU4,CS4=EV4,CT4=EW4,CU4=EX4,CV4=EY4,CW4=EZ4,CX4=FA4,CY4=FB4,CZ4=FC4,DA4=FD4,DB4=FE4,DC4=FF4,DD4=FG4,DE4=FH4,DF4=FI4,DG4=FJ4,DH4=FK4,DI4=FL4),\"Pass\",\"Fail\")","v":"Pass"},"Y","2020-11-16T11:27:31",null,"Case 2","Neil",null,null,"FAIL",0.88498588985800319,"Correct"]
[1000000,0.05,"Full Doc",15,3,0,0,0,0,0,0,0,0,0,0,0,0,50000,70000,80000,0,0,0,0,0,"Individual (Couple)",0,0,0,"N/A",0,0,0,2,0,0,0,30000,0,0,0,0,0,0,0,0,0,0,0,0,0,0,0,4000,0,10000,0,1000,9248.9,4166.67,184000,0,30000,0,0,0,30000,2842,0,0,0,-645,0,0,0,27803,0,0,0,27803,30000,0,0,0,30000,0,0,0,0,32997.199999999997,0,0,0,32997.199999999997,48000,48000,0,16584,5.5E-2,2.5000000000000001E-2,3.8199999999999998E-2,3.6700000000000003E-2,1.25,0.8,0.26,147219,50000,110986.85,2.9443800000000002,1.3264544447647086,"PASS","Refer BDM","COMPLETE",9248.9,4166.67,184000,0,30000,0,0,0,30000,2842,0,0,0,-645,0,0,0,27803,0,0,0,27803,30000,0,0,0,30000,0,0,0,0,32997.199999999997,0,0,0,32997.199999999997,48000,48000,0,16584,5.5E-2,2.5000000000000001E-2,3.8199999999999998E-2,3.6700000000000003E-2,1.25,0.8,0.26,147219,50000,110986.85,2.9443800000000002,1.3264544447647086,"PASS","Refer BDM","COMPLETE","Pass","Y","2020-11-16T11:27:38",null,"Case 3","Neil",null,null,"Refer BDM",1.3264544447647086,"Correct"]
[1000000,0.05,"Alt Doc",12,0,0,0,0,0,0,0,0,0,0,0,0,0,50000,70000,0,0,0,0,0,0,0,0,0,0,0,0,0,0,0,0,0,0,0,0,0,0,0,0,0,0,0,0,0,0,0,0,0,0,0,0,0,0,0,9248.9,0,120000,0,0,0,0,0,0,0,0,0,0,0,0,0,0,0,0,0,0,0,0,0,0,0,0,0,0,0,0,0,0,0,0,0,0,0,0,0,5.5E-2,2.5000000000000001E-2,3.8199999999999998E-2,3.6700000000000003E-2,1.25,0.8,0.26,120000,50000,110986.85,2.4,1.081209173895795,"PASS","FAIL","COMPLETE",9248.9,0,120000,0,0,0,0,0,0,0,0,0,0,0,0,0,0,0,0,0,0,0,0,0,0,0,0,0,0,0,0,0,0,0,0,0,0,0,0,0,5.5E-2,2.5000000000000001E-2,3.8199999999999998E-2,3.6700000000000003E-2,1.25,0.8,0.26,120000,50000,110986.85,2.4,1.081209173895795,"PASS","FAIL","COMPLETE","Pass","Y","2020-11-16T11:27:46",null,"Case 4","Neil",null,null,"FAIL",1.081209173895795,"Correct"]
[1000000,0.05,"Alt Doc",15,3,0,0,0,0,0,0,0,0,0,0,0,0,50000,70000,0,0,0,0,0,0,"Individual (Couple)",0,0,0,"N/A",0,0,0,2,0,0,0,30000,0,0,0,0,0,0,0,0,0,0,0,0,0,0,0,2000,0,10000,0,1000,9248.9,4166.67,120000,0,30000,0,0,0,30000,2842,0,0,0,-645,0,0,0,27803,0,0,0,27803,30000,0,0,0,30000,0,0,0,0,32997.199999999997,0,0,0,32997.199999999997,24000,32997.199999999997,0,16584,5.5E-2,2.5000000000000001E-2,3.8199999999999998E-2,3.6700000000000003E-2,1.25,0.8,0.26,98221.8,50000,110986.85,1.9644359176182054,0.88498588985800319,"PASS","FAIL","COMPLETE",9248.9,4166.67,120000,0,30000,0,0,0,30000,2842,0,0,0,-645,0,0,0,27803,0,0,0,27803,30000,0,0,0,30000,0,0,0,0,32997.199999999997,0,0,0,32997.199999999997,24000,32997.199999999997,0,16584,5.5E-2,2.5000000000000001E-2,3.8199999999999998E-2,3.6700000000000003E-2,1.25,0.8,0.26,98221.8,50000,110986.85,1.9644359176182054,0.88498588985800319,"PASS","FAIL","COMPLETE","Pass","Y","2020-11-16T11:27:54",null,"Case 5","Neil",null,null,"FAIL",0.88498588985800319,"Correct"]
[830000,9.8470000000000002E-2,"Full Doc",15,3,0,0,0,0,0,0,0,0,0,0,0,0,50000,70000,80000,0,0,0,0,0,"Individual (Couple)",0,0,0,"N/A",0,0,0,2,0,0,0,30000,0,0,0,0,0,0,0,0,0,0,0,0,0,0,0,4000,0,10000,0,1000,9845.93,6810.84,184000,0,30000,0,0,0,30000,2842,0,0,0,-645,0,0,0,27803,0,0,0,27803,30000,0,0,0,30000,0,0,0,0,32997.199999999997,0,0,0,32997.199999999997,48000,48000,0,16584,5.5E-2,2.5000000000000001E-2,3.8199999999999998E-2,3.6700000000000003E-2,1.25,0.8,0.26,147219,81730.100000000006,118151.13,1.8012825140309383,1.246022771740553,"PASS","Refer BDM","COMPLETE",9845.93,6810.84,184000,0,30000,0,0,0,30000,2842,0,0,0,-645,0,0,0,27803,0,0,0,27803,30000,0,0,0,30000,0,0,0,0,32997.199999999997,0,0,0,32997.199999999997,48000,48000,0,16584,5.5E-2,2.5000000000000001E-2,3.8199999999999998E-2,3.6700000000000003E-2,1.25,0.8,0.26,147219,81730.100000000006,118151.13,1.8012825140309383,1.246022771740553,"PASS","Refer BDM","COMPLETE","Pass","Y","2020-11-16T11:28:02",null,"Case 6","Neil",null,null,"Refer BDM",1.246022771740553,"Correct"]
[832000,9.8470000000000002E-2,"Full Doc",15,3,0,0,0,0,0,0,0,0,0,0,0,0,50000,70000,80000,0,0,0,0,0,"Individual (Couple)",0,0,0,"N/A",0,0,0,2,0,0,0,30000,0,0,0,0,0,0,0,0,0,0,0,0,0,0,0,4000,0,10000,0,1000,9869.65,6827.25,184000,0,30000,0,0,0,30000,2842,0,0,0,-645,0,0,0,27803,0,0,0,27803,30000,0,0,0,30000,0,0,0,0,32997.199999999997,0,0,0,32997.199999999997,48000,48000,0,16584,5.5E-2,2.5000000000000001E-2,3.8199999999999998E-2,3.6700000000000003E-2,1.25,0.8,0.26,147219,81927.039999999994,118435.83,1.7969525079875945,1.2430275246930997,"PASS","FAIL","COMPLETE",9869.65,6827.25,184000,0,30000,0,0,0,30000,2842,0,0,0,-645,0,0,0,27803,0,0,0,27803,30000,0,0,0,30000,0,0,0,0,32997.199999999997,0,0,0,32997.199999999997,48000,48000,0,16584,5.5E-2,2.5000000000000001E-2,3.8199999999999998E-2,3.6700000000000003E-2,1.25,0.8,0.26,147219,81927.039999999994,118435.83,1.7969525079875945,1.2430275246930997,"PASS","FAIL","COMPLETE","Pass","Y","2020-11-16T11:28:09",null,"Case 7","Neil",null,null,"FAIL",1.2430275246930997,"Correct"]
[1000000,9.8470000000000002E-2,"Full Doc",15,3,0,0,0,0,0,0,0,0,0,0,0,0,50000,70000,80000,0,0,0,0,0,"Individual (Couple)",0,0,0,"N/A",0,0,0,2,0,0,0,30000,0,0,0,0,0,0,0,0,0,0,0,0,0,0,0,4000,0,10000,0,1000,11862.56,8205.83,184000,0,30000,0,0,0,30000,2842,0,0,0,-645,0,0,0,27803,0,0,0,27803,30000,0,0,0,30000,0,0,0,0,32997.199999999997,0,0,0,32997.199999999997,48000,48000,0,16584,5.5E-2,2.5000000000000001E-2,3.8199999999999998E-2,3.6700000000000003E-2,1.25,0.8,0.26,147219,98470,142350.76,1.4950644866456788,1.0341989005446588,"PASS","FAIL","COMPLETE",11862.56,8205.83,184000,0,30000,0,0,0,30000,2842,0,0,0,-645,0,0,0,27803,0,0,0,27803,30000,0,0,0,30000,0,0,0,0,32997.199999999997,0,0,0,32997.199999999997,48000,48000,0,16584,5.5E-2,2.5000000000000001E-2,3.8199999999999998E-2,3.6700000000000003E-2,1.25,0.8,0.26,147219,98470,142350.76,1.4950644866456788,1.0341989005446588,"PASS","FAIL","COMPLETE","Pass","Y","2020-11-16T11:28:17",null,"Case 8","Neil",null,null,"FAIL",1.0341989005446588,"Correct"]
[1000000,9.8479999999999998E-2,"Full Doc",15,3,0,0,0,0,0,0,0,0,0,0,0,0,50000,70000,80000,0,0,0,0,0,"Individual (Couple)",0,0,0,"N/A",0,0,0,2,0,0,0,30000,0,0,0,0,0,0,0,0,0,0,0,0,0,0,0,4000,0,10000,0,1000,11863.14,8206.67,184000,0,30000,0,0,0,30000,2842,0,0,0,-645,0,0,0,27803,0,0,0,27803,30000,0,0,0,30000,0,0,0,0,32997.199999999997,0,0,0,32997.199999999997,48000,48000,0,16584,5.5E-2,2.5000000000000001E-2,3.8199999999999998E-2,3.6700000000000003E-2,1.25,0.8,0.26,147219,98480,142357.67000000001,1.4949126726238831,1.0341487293022722,"FAIL","FAIL","COMPLETE",11863.14,8206.67,184000,0,30000,0,0,0,30000,2842,0,0,0,-645,0,0,0,27803,0,0,0,27803,30000,0,0,0,30000,0,0,0,0,32997.199999999997,0,0,0,32997.199999999997,48000,48000,0,16584,5.5E-2,2.5000000000000001E-2,3.8199999999999998E-2,3.6700000000000003E-2,1.25,0.8,0.26,147219,98480,142357.67000000001,1.4949126726238831,1.0341487293022722,"FAIL","FAIL","COMPLETE","Pass","Y","2020-11-16T11:28:26",null,"Case 9","Neil",null,null,"FAIL",1.0341487293022722,"Correct"]
[1000000,8.4400000000000003E-2,"Alt Doc",15,3,0,0,0,0,0,0,0,0,0,0,0,0,50000,70000,80000,0,0,0,0,0,"Individual (Couple)",0,0,0,"N/A",0,0,0,2,0,0,0,30000,0,0,0,0,0,0,0,0,0,0,0,0,0,0,0,4000,0,10000,0,1000,11067.23,7033.33,184000,0,30000,0,0,0,30000,2842,0,0,0,-645,0,0,0,27803,0,0,0,27803,30000,0,0,0,30000,0,0,0,0,32997.199999999997,0,0,0,32997.199999999997,48000,48000,0,16584,5.5E-2,2.5000000000000001E-2,3.8199999999999998E-2,3.6700000000000003E-2,1.25,0.8,0.26,147219,84400,132806.82,1.7443009478672986,1.108519913348835,"FAIL","FAIL","COMPLETE",11067.23,7033.33,184000,0,30000,0,0,0,30000,2842,0,0,0,-645,0,0,0,27803,0,0,0,27803,30000,0,0,0,30000,0,0,0,0,32997.199999999997,0,0,0,32997.199999999997,48000,48000,0,16584,5.5E-2,2.5000000000000001E-2,3.8199999999999998E-2,3.6700000000000003E-2,1.25,0.8,0.26,147219,84400,132806.82,1.7443009478672986,1.108519913348835,"FAIL","FAIL","COMPLETE","Pass","Y","2020-11-16T11:28:34",null,"Case 10","Neil",null,null,"FAIL",1.108519913348835,"Correct"]
[1000000,8.43E-2,"Alt Doc",15,3,0,0,0,0,0,0,0,0,0,0,0,0,50000,70000,80000,0,0,0,0,0,"Individual (Couple)",0,0,0,"N/A",0,0,0,2,0,0,0,30000,0,0,0,0,0,0,0,0,0,0,0,0,0,0,0,4000,0,10000,0,1000,11061.69,7025,184000,0,30000,0,0,0,30000,2842,0,0,0,-645,0,0,0,27803,0,0,0,27803,30000,0,0,0,30000,0,0,0,0,32997.199999999997,0,0,0,32997.199999999997,48000,48000,0,16584,5.5E-2,2.5000000000000001E-2,3.8199999999999998E-2,3.6700000000000003E-2,1.25,0.8,0.26,147219,84300,132740.24,1.7463701067615658,1.1090759209102476,"PASS","FAIL","COMPLETE",11061.69,7025,184000,0,30000,0,0,0,30000,2842,0,0,0,-645,0,0,0,27803,0,0,0,27803,30000,0,0,0,30000,0,0,0,0,32997.199999999997,0,0,0,32997.199999999997,48000,48000,0,16584,5.5E-2,2.5000000000000001E-2,3.8199999999999998E-2,3.6700000000000003E-2,1.25,0.8,0.26,147219,84300,132740.24,1.7463701067615658,1.1090759209102476,"PASS","FAIL","COMPLETE","Pass","Y","2020-11-16T11:28:42",null,"Case 11","Neil",null,null,"FAIL",1.1090759209102476,"Correct"]
[1000000,0.05,"Full Doc",15,3,0,0,0,0,0,0,0,0,0,0,0,0,50000,70000,0,0,0,0,0,0,"Individual (Couple)",0,0,0,"N/A",0,0,0,2,0,0,0,55000,0,0,0,0,0,0,0,0,0,0,0,0,0,0,0,2000,0,10000,0,1000,9248.9,4166.67,120000,0,55000,0,0,0,55000,9442,0,0,0,-705,0,0,0,46263,0,0,0,46263,55000,0,0,0,55000,0,0,0,0,36867.74,0,0,0,36867.74,24000,36867.74,0,16584,5.5E-2,2.5000000000000001E-2,3.8199999999999998E-2,3.6700000000000003E-2,1.25,0.8,0.26,112811.26,50000,110986.85,2.2562251398216242,1.016438049812276,"PASS","FAIL","COMPLETE",9248.9,4166.67,120000,0,55000,0,0,0,55000,9442,0,0,0,-705,0,0,0,46263,0,0,0,46263,55000,0,0,0,55000,0,0,0,0,36867.74,0,0,0,36867.74,24000,36867.74,0,16584,5.5E-2,2.5000000000000001E-2,3.8199999999999998E-2,3.6700000000000003E-2,1.25,0.8,0.26,112811.26,50000,110986.85,2.2562251398216242,1.016438049812276,"PASS","FAIL","COMPLETE","Pass","Y","2020-11-16T11:28:50",null,"Case 12","Neil",null,null,"FAIL",1.0067071672472139,"Correct"]
[1000000,0.05,"Full Doc",15,3,0,0,0,0,0,0,0,0,0,0,0,0,50000,70000,0,0,0,0,0,0,"Individual (Couple)","Individual (Single)",0,0,"N/A",0,0,0,2,0,0,0,55000,100000,0,0,0,0,0,0,0,0,0,0,0,0,0,0,2000,0,10000,0,1000,9248.9,4166.67,120000,0,55000,100000,0,0,155000,9442,24967,0,0,-705,-380,0,0,46263,75413,0,0,121676,55000,100000,0,0,155000,0,0,0,0,36867.74,24071.98,0,0,60939.72,24000,60939.72,0,16584,5.5E-2,2.5000000000000001E-2,3.8199999999999998E-2,3.6700000000000003E-2,1.25,0.8,0.26,164152.28,50000,110986.85,3.2830456347484827,1.4790246077535845,"PASS","Refer BDM","COMPLETE",9248.9,4166.67,120000,0,55000,100000,0,0,155000,9442,24967,0,0,-705,-380,0,0,46263,75413,0,0,121676,55000,100000,0,0,155000,0,0,0,0,36867.74,24071.98,0,0,60939.72,24000,60939.72,0,16584,5.5E-2,2.5000000000000001E-2,3.8199999999999998E-2,3.6700000000000003E-2,1.25,0.8,0.26,164152.28,50000,110986.85,3.2830456347484827,1.4790246077535845,"PASS","Refer BDM","COMPLETE","Pass","Y","2020-11-16T11:28:57",null,"Case 13","Neil",null,null,"Refer BDM",1.4555083082213509,"Correct"]
[1000000,0.05,"Full Doc",15,3,0,0,0,0,0,0,0,0,0,0,0,0,50000,70000,0,0,0,0,0,0,"Individual (Couple)","Individual (Single)",0,0,"N/A",0,0,0,2,0,0,0,55000,112000,0,0,0,0,0,0,0,0,0,0,0,0,0,0,2000,0,10000,0,1000,9248.9,4166.67,120000,0,55000,112000,0,0,167000,9442,29107,0,0,-705,-200,0,0,46263,83093,0,0,129356,55000,112000,0,0,167000,0,0,0,0,36867.74,26723.21,0,0,63590.95,24000,63590.95,0,16584,5.5E-2,2.5000000000000001E-2,3.8199999999999998E-2,3.6700000000000003E-2,1.25,0.8,0.26,169181.05,50000,110986.85,3.3836209495785452,1.5243341715293017,"PASS","PASS","COMPLETE",9248.9,4166.67,120000,0,55000,112000,0,0,167000,9442,29107,0,0,-705,-200,0,0,46263,83093,0,0,129356,55000,112000,0,0,167000,0,0,0,0,36867.74,26723.21,0,0,63590.95,24000,63590.95,0,16584,5.5E-2,2.5000000000000001E-2,3.8199999999999998E-2,3.6700000000000003E-2,1.25,0.8,0.26,169181.05,50000,110986.85,3.3836209495785452,1.5243341715293017,"PASS","PASS","COMPLETE","Pass","Y","2020-11-16T11:29:05",null,"Case 14","Neil",null,null,"PASS",1.4959524307145371,"Correct"]
[1000000,0.05,"Full Doc",15,3,0,0,0,0,0,0,0,0,0,0,0,0,50000,70000,0,0,0,0,0,0,"Individual (Couple)","Individual (Single)",0,0,"N/A",0,0,0,2,0,0,0,55000,113000,0,0,0,0,0,0,0,0,0,0,0,0,0,0,2000,0,10000,0,1000,9248.9,4166.67,120000,0,55000,113000,0,0,168000,9442,29452,0,0,-705,-185,0,0,46263,83733,0,0,129996,55000,113000,0,0,168000,0,0,0,0,36867.74,26723.21,0,0,63590.95,24000,63590.95,0,16584,5.5E-2,2.5000000000000001E-2,3.8199999999999998E-2,3.6700000000000003E-2,1.25,0.8,0.26,169821.05,50000,110986.85,3.3964209495785456,1.530100620456746,"PASS","PASS","COMPLETE",9248.9,4166.67,120000,0,55000,113000,0,0,168000,9442,29452,0,0,-705,-185,0,0,46263,83733,0,0,129996,55000,113000,0,0,168000,0,0,0,0,36867.74,26723.21,0,0,63590.95,24000,63590.95,0,16584,5.5E-2,2.5000000000000001E-2,3.8199999999999998E-2,3.6700000000000003E-2,1.25,0.8,0.26,169821.05,50000,110986.85,3.3964209495785456,1.530100620456746,"PASS","PASS","COMPLETE","Pass","Y","2020-11-16T11:29:13",null,"Case 15","Neil",null,null,"PASS",1.5013134262017704,"Correct"]
[1000000,0.05,"Full Doc",15,3,0,0,0,0,0,0,0,0,0,0,0,0,50000,70000,0,0,0,0,0,0,"Individual (Couple)","Individual (Single)",0,0,"N/A",0,0,0,2,0,0,0,55000,52000,0,0,0,0,0,0,0,0,0,0,0,0,0,0,2000,0,10000,0,1000,9248.9,4166.67,120000,0,55000,52000,0,0,107000,9442,8407,0,0,-705,-750,0,0,46263,44343,0,0,90606,55000,52000,0,0,107000,0,0,0,0,36867.74,15923.21,0,0,52790.95,24000,52790.95,0,16584,5.5E-2,2.5000000000000001E-2,3.8199999999999998E-2,3.6700000000000003E-2,1.25,0.8,0.26,141231.04999999999,50000,110986.85,2.8246209571236314,1.2725025381751629,"PASS","Refer BDM","COMPLETE",9248.9,4166.67,120000,0,55000,52000,0,0,107000,9442,8407,0,0,-705,-750,0,0,46263,44343,0,0,90606,55000,52000,0,0,107000,0,0,0,0,36867.74,15923.21,0,0,52790.95,24000,52790.95,0,16584,5.5E-2,2.5000000000000001E-2,3.8199999999999998E-2,3.6700000000000003E-2,1.25,0.8,0.26,141231.04999999999,50000,110986.85,2.8246209571236314,1.2725025381751629,"PASS","Refer BDM","COMPLETE","Pass","Y","2020-11-16T11:29:20",null,"Case 16","Neil",null,null,"Refer BDM",1.2530407730450386,"Correct"]
[1000000,0.05,"Full Doc",15,3,0,0,0,0,0,0,0,0,0,0,0,0,50000,70000,0,0,0,0,0,0,"Individual (Couple)","Individual (Single)",0,0,"N/A",0,0,0,2,0,0,0,55000,50200,0,0,0,0,0,0,0,0,0,0,0,0,0,0,2000,0,10000,0,1000,9248.9,4166.67,120000,0,55000,50200,0,0,105200,9442,7786,0,0,-705,-777,0,0,46263,43191,0,0,89454,55000,50200,0,0,105200,0,0,0,0,36867.74,15923.21,0,0,52790.95,24000,52790.95,0,16584,5.5E-2,2.5000000000000001E-2,3.8199999999999998E-2,3.6700000000000003E-2,1.25,0.8,0.26,140079.04999999999,50000,110986.85,2.8015809571236314,1.2621229301057633,"PASS","Refer BDM","COMPLETE",9248.9,4166.67,120000,0,55000,50200,0,0,105200,9442,7786,0,0,-705,-777,0,0,46263,43191,0,0,89454,55000,50200,0,0,105200,0,0,0,0,36867.74,15923.21,0,0,52790.95,24000,52790.95,0,16584,5.5E-2,2.5000000000000001E-2,3.8199999999999998E-2,3.6700000000000003E-2,1.25,0.8,0.26,140079.04999999999,50000,110986.85,2.8015809571236314,1.2621229301057633,"PASS","Refer BDM","COMPLETE","Pass","Y","2020-11-16T11:29:28",null,"Case 17","Neil",null,null,"FAIL",1.2426611649756389,"Correct"]

{"sheet":"User Guide - Residential","index":14,"n_rows":39,"n_cols":2,"rows_kept":39,"cut":false,"hidden":false,"merged":[[20,1,21,1]]}
["User Guide - Residential Serviceability Calculator"]
[]
["Field Name","Instruction"]
["Clear Form (BUTTON)","Allows the user to clear all input fields in the calculator"]
["Applicant Name","Applicants name"]
["New Loan Amount","Mandatory field - Total loan amount including any capitalised fees"]
["Interest Rate","Mandatory field - Actual interest rate of the proposed loan "]
["Loan Term","Mandatory field - The total loan term of the proposed loan (cannot exceed 30 years on Prime or 40 years on Near Prime or Specialist products) "]
["I/O Term","The interest only term of the proposed loan. Leave blank if not applicable (will not allow IO term to exceed 5 years)"]
["Status","Mandatory field - For each applicant of the loan, what is their marital status. Drop down selection of Single, Couple, Company. Note, if Company status all income will be calculated based on Company tax rates. "]
["Couple with","Mandatory field - Links applicants who are a couple for household income band selection for living expense benchmark. \nThis field must be correctly completed for both individuals of a couple, where one member of a couple is not correctly linked the living expense will be calculated as an additional couple living expense.\nDrop down selection N/A, Non-Loan Party or Applicant “X” when another Applicant is applied with a Couple status"]
["Dependents","Number of child dependents, aged < 18, the Applicant has. Each dependent child must only be entered once per couple. If a dependent is entered for both individuals of a couple, that dependent will be counted twice."]
["Gross Annual Income","The applicants income from acceptable taxable income sources"]
["Untaxed Allowable Income","Income from acceptable untaxed income sources such as Centrelink allowances. Tax is not calculated on this income"]
["Self Employed Income","Income from self-employed activities, this income is taxed at personal tax rates and should not be duplicated if this income has already been entered in Gross Annual Income. \nOptional Macro: Where the SEIC has been used and “Apply Values to Servicing Calculator” macro executed, this field will populate with the results from the SEIC"]
["Addbacks","Allowable addbacks to be entered such as depreciation or non-recurring expenses.\nOptional Macro: Where the SEIC has been used and “Apply Values to Servicing Calculator” macro executed, this field will populate with the results from the SEIC"]
["Business NPBT","Self employed income that is to be taxed at company tax rates."]
["Self-Employed Worksheet (BUTTON)","Takes user to the SEIC tab"]
["Gross Rental Income","Rental income entered at 100%. For the purposes of allowable income for serviceability, 80% of this income is used for servicing."]
["Investment Property Loan Balance","This is the total balance of investment loans held by the applicant. For tax purposes, negative gearing will be applied to the calculated taxable income. For company applicants, if this interest has been calculated in the SEIC then this field should not be populated."]
["Owner occupied property costs including utilities, rates & expenses","Mandatory fields - Include council rates, water, gas & electricity utility bills and body corporate fees where applicable for property owned by the applicant. Assessment should account for these expenses giving account to the type of property (location, house or unit and size). "]
["Investment property costs including utilities, rates & expenses"]
["Renter property costs","Mandatory field - Include water, gas & electricity bills if the applicant is renting. Assessment should account for these expenses giving account to the type of property (location and size). "]
["Telephone, internet, Pay TV & media streaming","Mandatory field - Unless an applicant has a mobile phone supplied by their employer, it is expected that each applicant would have a mobile phone expense. If they have a home phone number, they may have a ‘bundle’ with a telco which includes internet."]
["Groceries","Mandatory field - It is expected that all applicants will have a grocery expense that is reasonable for their family unit size. "]
["Recreation & Entertainment","Mandatory field - It is expected that all applicants will have some form of recreation & entertainment cost. This includes alcohol, tobacco, gambling, restaurants and membership fees."]
["Clothing & Personal Care","Mandatory field - It is expected that all applicants will have clothing and personal care expenses that is reasonable for their family unit size. "]
["Medical & Health","Mandatory field - As an applicant’s age increase it is expected that medical and health costs will increase. In some case this cost may be $0 however given the customers circumstance it should be understood why through additional inquiry."]
["Transport","Mandatory field - It is expected that all applicants will have a transport cost that is reasonable for their assets and employment position. What are the running costs of each car owned including petrol and servicing or what are the costs of public transport where they commute for work. \nOne exception may be where an applicant has one car only which is provided by their employer or running costs are already include in novated lease payments."]
["Education","Mandatory field - Where the applicant(s) has school aged children is the declared amount reasonable to cover schools fees, uniform costs and books (if high school). Does the affluency of the applicant indicate that their children may attend a private school, if so, has this been declared by the customer. "]
["Childcare ","Mandatory field - Where the applicant(s) has pre-school aged children and all applicants work, has a child care cost been included that is reasonable for the location accounting for any rebate that may be due. Where this is applicable and declared expense is $0 additional inquiry needs to be made."]
["Insurance","Mandatory field - Do the below insurances apply to the applicant(s) and have they been accounted for:\n- House owners with home insurance\n- Car owners (accounted for each car)\n- Private Health - particularly where income is > $90,000 and applicant is single or > $180,000 for families\n- Income and life insurance \n- Pet insurance \n"]
["Other","Mandatory field - This is to capture unique items not covered for in the above categories that may be applicable to the applicant(s)."]
["Rent/Board","Rental or board expense paid by the customer."]
["Total Credit Card Limit","Total credit card limit of all continuing credit cards."]
["Other Mortgage Repayments","Mortgage repayments of any other continuing mortgage repayments."]
["Other Liabilities","Any other commitments the borrower has such as personal loans, child support, HEC’s."]
["Eligible Loan Amount","Where the NSR = FAIL an offer as to the maximum loan amount the customer can qualify for to pass the minimum NSR of 1x or 1.25x if > 50% of income is from untaxed sources. Otherwise the applied loan amount is shown."]
["Maximum Serviceable Loan Amount","This is an indication of the maximum loan amount that the borrower can service. "]

{"sheet":"User Guide - SEIC","index":15,"n_rows":28,"n_cols":2,"rows_kept":28,"cut":false,"hidden":false,"merged":[]}
["User Guide - Self Employed Income Calculator (SEIC)"]
[]
["Field Name","Explanation"]
["Clear Form (BUTTON)","Allows the user to clear all fields in the calculator"]
["Apply Values","Applies outputs from Self- employed income Calc into the Servicing Calculator"]
["Return to Calculator (BUTTON)","Returns to Servicing Calculator."]
["Financials for year ended Most Recent Year","Year financial year ends of financial statement period"]
["Financials for year ended Previous Year","Year financial year ends of financial statement period"]
["Gross Business Income","Gross business income off Profit and Loss statement"]
["Less Expenses","Total expenses including COGS from Profit and Loss statement"]
["Plus Superannuation over 9.5%","Discretionary superannuation paid >9.5% of wages from Profit and Loss statement"]
["Plus Depreciation","As advised in Profit and Loss statement"]
["Interest /Leasing Charges","As advised in Profit and Loss statement"]
["Ongoing Loan Repayments","Business loan repayments that will continue after the settlement of subject Pepper loan"]
["Director Wages Applicant 1","Wages paid to director"]
["Director Wages Applicant 2","Wages paid to director"]
["Director Wages Applicant 3","Wages paid to director"]
["Director Wages Applicant 4","Wages paid to director"]
["Director Wages Applicant 5","Wages paid to director"]
["Director Wages Applicant 6","Wages paid to director"]
["Applicants Entitlement/Applicant 1","% ownership of  this applicant of Business/Company or Trust"]
["Applicants Entitlement/Applicant 2","% ownership of  this applicant of Business/Company or Trust"]
["Applicants Entitlement/Applicant 3","% ownership of  this applicant of Business/Company or Trust"]
["Applicants Entitlement/Applicant 4","% ownership of  this applicant of Business/Company or Trust"]
["Applicants Entitlement/Applicant 5","% ownership of  this applicant of Business/Company or Trust"]
["Applicants Entitlement/Applicant 6","% ownership of  this applicant of Business/Company or Trust"]
["Apply Values (BUTTON)","Applies outputs from SELF employed income calc into residential Servicing calculator"]
["Return To Calculator (BUTTON)","Returns to Servicing Calculator Tab"]

{"sheet":"User Guide - Commercial","index":16,"n_rows":42,"n_cols":2,"rows_kept":42,"cut":false,"hidden":false,"merged":[]}
["CRE Servicing Calculator"]
[]
["Field Name","Instruction"]
["Clear Form (BUTTON)","Allows the user to clear all fields in the calculator"]
["Applicant name","Applicants name"]
["New Loan Amount","Mandatory field - total loan amount including any capitalised fees"]
["Interest Rate","Mandatory field - actual interest rate of the proposed loan"]
["Documentation Type","Mandatory field - identify whether FullDoc or AltDoc or LeaseDoc income documentation"]
["Loan Term (Years)","Mandatory field -  the total loan term of the proposed loan (maximum term 25 years)"]
["I/O Term (Years)","The interest only term of the proposed loan. Left blank if not applicable (maximum term 5 years allowed)"]
["Loan 1-4 Loan Amount","Outstanding loan amount of external business loan"]
["Loan 1-4 Rate","Current interest rate of external business loan"]
["Loan 1-4 Actual Loan Repayment (Monthly)","Current monthly loan repayments under contract for external business loan"]
["Net Profit before Tax","Net Profit Before Tax per annum from business activities of applicant"]
["Depreciation","Depreciation expense per annum from the business activities of applicant (obtained from Profit & Loss statements)"]
["Proposed Net CRE Rental Income","100% of CRE rental income after outgoings paid for by landlord"]
["Amortisation","Amortisation expense per annum from business activities of the applicant (obtained from Profit & Loss statements)"]
["Proposed Gross Residential Rental Income","100% of gross residential rental income if to be received by the business"]
["Interest Paid","Actual interest paid per annum from the business (obtained from Profit & Loss statements)"]
["Directors Salaries/Fees/Super","Actual Directors Salaries/Fees/Superannuation payments per annum paid by the business activities of the applicant (obtained from Profit & Loss statements/personal tax returns). CARE: do not duplicate in personal income"]
["Other","Actual expenses per annum which are non-recurring and are paid by the business activities of the applicant (obtained from Profit & Loss statements)"]
["Earnings before Interest, Tax, Depreciation & Amortisation (EBITDA)","Formula: Summation of all business income and addbacks subject to 80% (Proposed Gross residential Rental Income)"]
["Total Add Backs","Formula: Summation of all add backs"]
["Status","For each applicant of the loan, what is their marital status. "]
["Couple With","Links applicants who are a couple for household income band selection for living expense benchmark. This field must be correctly completed for both individuals of a couple, where one member of a couple is not correctly linked the living expense will be calculated as an additional couple living expense. Drop down selection N/A, Non-Loan Party or Applicant “X” when another Applicant is applied with a Couple status"]
["Dependents","Number of child dependents, aged < 18, the Applicant has. Each dependent child must only be entered once per couple. If a dependent is entered for both individuals of a couple, that dependent will be counted twice."]
["Gross Annual Income","Gross annual income of applicant from acceptable taxable income sources external to business income. Do NOT include Directors Fees/Salary/Super if included in addbacks."]
["Untaxed Allowable Income","Income from acceptable untaxed income sources. Tax is not calculated on this income."]
["Gross Residential Rental Income (Other)","Rental income entered at 100%. For the purposes of allowable income for serviceability, 80% of this income is used for servicing. Care: do NOT enter if income has been included under Business Income."]
["Investment Property Loan Balance (personal name)","This is the total balance of investment loans held by the applicant. For tax purposes, negative gearing will be applied to the calculated taxable income. For company applicants, if this interest has been calculated in the SEIC then this field should not be populated."]
["Declared Living Expenses","Total personal living expenses per month declared by the customer (sum of all applicants declared living expenses)"]
["Rent/Board","Rental or board expense paid by the customer."]
["Total Credit Card Limit","Total credit card limit of all continuing credit cards."]
["Personal Mortgage Repayments","Mortgage repayments of any Personal continuing mortgage repayments."]
["Other Consumer Debt","Any other commitments the borrower has such as personal loans, child support, HEC’s."]
["Business Income (EBITDA + net personal contribution)","Formula: EBITDA plus Net Personal Contribution "]
["Interest Expenses","Formula: Total Interest Expenses per annum for all business debt (Pepper and external), including existing and proposed business loans"]
["Debt Repayments","Formula: Total contracted business debt repayments per annum including Proposed loan (if applicable, would include P&I repayments over residual term after any interest only period)"]
["Interest Cover Ratio (ICR)","Formula: Business Income divided by Interest Expenses"]
["ICR Outcome","Formula: All mandatory fields to be completed otherwise shows incomplete, where ICR < 1.5 (Full Doc) or <1.75 (Alt Doc) then result is FAIL otherwise result is PASS  "]
["Debt Service Coverage Ratio (DSCR)","Formula: Business Income divided by debt repayments"]
["DSCR Outcome","Formula: All mandatory fields to be completed otherwise shows incomplete, where ICR < 1.25 then result is FAIL otherwise result is PASS"]

{"sheet":"Assessment Notes - Residential","index":17,"n_rows":140,"n_cols":29,"rows_kept":140,"cut":false,"hidden":true,"merged":[[25,0,25,1],[28,2,30,2],[0,0,0,2],[14,0,14,1],[15,0,15,1],[16,0,16,1],[24,0,24,1],[17,0,17,1],[13,0,13,1],[10,0,10,1],[20,0,20,1],[21,0,21,1],[22,0,22,1],[23,0,23,1],[8,0,8,1],[44,6,47,8],[48,0,48,1],[31,5,32,5],[1,0,1,1],[2,0,2,1],[5,0,5,1],[7,0,7,1],[9,0,9,1],[7,3,7,5],[8,3,8,5],[26,0,26,1],[27,0,27,1],[11,0,11,1],[18,0,18,1],[19,0,19,1],[12,0,12,1],[5,3,5,5],[3,0,3,1],[4,0,4,1],[6,0,6,1],[6,3,6,5],[0,3,0,5],[1,3,1,5],[2,3,2,5],[4,3,4,5],[3,3,3,5],[73,1,73,2],[52,0,52,2],[53,0,53,1],[54,0,54,1],[55,0,55,1],[59,0,59,1],[60,0,60,1],[61,0,61,1],[66,1,66,2],[67,1,67,2],[68,1,68,2],[69,1,69,2],[70,1,70,2],[71,1,71,2],[72,1,72,2],[62,0,62,1],[63,0,63,1],[64,0,64,1],[58,0,58,2],[15,3,15,5],[16,3,16,5],[17,3,17,5],[18,3,18,5],[19,3,19,5],[20,3,20,5],[31,1,33,1],[34,1,41,1],[46,0,46,1],[47,0,47,1],[44,0,44,1],[45,0,45,1],[27,3,27,5],[9,4,9,5],[10,3,10,5],[11,3,11,5],[12,3,12,5],[13,3,13,5],[14,3,14,5],[21,3,21,5],[22,3,22,5],[24,3,24,5],[25,3,25,5],[23,3,23,5],[49,0,49,1],[42,1,43,1],[31,0,43,0],[26,3,26,5],[48,3,48,5],[49,3,49,5],[42,2,43,2],[44,3,44,5],[45,3,45,5],[46,3,46,5],[47,3,47,5],[31,2,33,2],[34,2,41,2],[28,3,30,5]]}
["UNDERWRITER NOTES",null,null,"INSTRUCTIONS",null,null,"CONDITIONS"]
["Loan Amount - Requested: ",null,null,"Loan amount requested by customer at application. ",null,null,null,null,null,null,null,null,null,null,null,null,null,"Prime Fulldoc"]
["Loan Amount - Approved:  ",null,null,"Loan amount approved as a result of this assessment.",null,null,null,null,null,null,null,null,null,null,null,null,null,"Prime Fulldoc PLUS"]
["LPF / MRF: ",null,null,"LPF or MRF applicable to the approved loan amount.",null,null,null,null,null,null,null,null,null,null,null,null,null,"Prime Fulldoc (Construction)"]
["Loan Amount - Final:   ",null,{"$f":"C3+C4","v":0},"Loan amount including any capitalised fees. This amount is to be entered into the Servicing Calculator for credit assessment purposes. ",null,null,null,null,null,null,null,null,null,null,null,null,null,"Prime Fulldoc PLUS (Construction)"]
["Security Estimate:",null,null,"Security value amount used for LVR calculation. ",null,null,null,null,null,null,null,null,null,null,null,null,null,"Prime Altdoc",null,null,null,null,null,null,null,null,null,"Have adopted Pepper’s minimum living expenses allowance as considered more reasonable than borrower advised amount","Have adopted Pepper’s minimum living expenses allowance as considered more reasonable than borrower advised amount"]
["LVR - Initial: ",null,{"$f":"C3/C6","v":{"$error":"#DIV/0!"}},"LVR based on loan amount before capitalised fees. ",null,null,null,null,null,null,null,null,null,null,null,null,null,"Prime Altdoc PLUS"]
["LVR - Final: ",null,{"$f":"C5/C6","v":{"$error":"#DIV/0!"}},"Total LVR based on loan amount plus capitalised fees. ",null,null,null,null,null,null,null,null,null,null,null,null,null,"Prime Altdoc (Construction)"]
["Global Exposure if other loans held",null,null,"Total Loan Amount and Total LVR of all Pepper exposure held. If this is the only loan \"No other exposure held\"",null,null,null,null,null,null,null,null,null,null,null,null,null,"Prime Altdoc PLUS (Construction)"]
["NSR **Min. 1.35x when end LVR >90%**: ",null,{"$f":"D10","v":0},{"$f":"ResiAssessmentNSR","v":0},"NSR based on total loan amount (plus capitalised fees if applicable). Cannot be < 1x or where LVR > 90% cannot be < 1.35x or where income from government support is > 50% of total income cannot be <1.25x. ",null,null,null,null,null,null,null,null,null,null,null,null,"Near Prime Fulldoc",null,null,null,null,null,null,null,null,null,null,"PEP checks verified.  Matches addressed and explained.  If EDD was completed - what information was collected and how was it verified."]
["Customers Requirements & Objectives:",null,null,"Comment on what the customers objective with the loan purpose is and whether the proposed loan meets the product requirements captured on the CRO form. ",null,null,null,null,null,null,null,null,null,null,null,null,null,"Near Prime Fulldoc PLUS"]
["Customer Benefit:",null,null,"What advantage is the customer receiving from the loan purpose and does this match with the Customers Requirements and Objectives.",null,null,null,null,null,null,null,null,null,null,null,null,null,"Near Prime Altdoc"]
["Product:",null,null,"Product that is recommended for approval. If this is different to what the customer has applied for then comment as to why it still meets the Customers Requirements and Objectives.",null,null,"Can attach here your Rate Card, LPF Calc, Postcode search etc…",null,null,null,null,null,null,null,null,null,null,"Near Prime Altdoc PLUS",null,null,null,null,null,null,null,null,"Rec for Approval. have made reasonable enquiries to verify that the product will not be unsuitable to the customers’ requirements and objectives and the loan will not cause the customer substantial hardship.  This assessment is valid for 90 days.",null,"Rec for Approval. have made reasonable enquiries to verify that the product will not be unsuitable to the customers’ requirements and objectives and the loan will not cause the customer substantial hardship.  This assessment is valid for 90 days."]
["Interest Only? (If O/O then document reason): ",null,null,"Why the applicant is seeking interest only  and whether the reasons are reasonable based on customers requirements and objectives, the purpose of the loan and the customers circumstances.  ",null,null,null,null,null,null,null,null,null,null,null,null,null,"Near Prime Fulldoc (Construction)"]
["Security Category:",null,null,"What is the security property location Category? If Prime and requires Metro category note here. ",null,null,null,null,null,null,null,null,null,null,null,null,null,"Near Prime Altdoc (Construction)"]
["High Density Area?",null,null,"Is the security property a unit in a high density postcode with more than 35 units?",null,null,null,null,null,null,null,null,null,null,null,null,null,"Specialist Fulldoc",null,null,null,null,null,null,null,null,null,null,"Prime Full Doc"]
["Fraud check:",null,null,"What is the outcome of the Equifax Fraud check in NextGen? If a match, to be referred to Senior or Team Leader to investigate the match. ",null,null,null,null,null,null,null,null,null,null,null,null,null,"Specialist Fulldoc PLUS",null,null,null,null,null,null,null,null,null,null,"Prime Alt Doc"]
["PEP & Sanctions check: ",null,null,"Is the applicant confirmed as being on the PEP or Sanctions register (not a potential match). If a match refer to dedicated team member for enhanced search. ",null,null,null,null,null,null,null,null,null,null,null,null,null,"Specialist Altdoc",null,null,null,null,null,null,null,null,null,null,"Prime PLUS Full Doc"]
["ID document is clear and valid? ",null,null,"Have the correct, clear  identification documents and Customer Identification form been completed correctly, signed?",null,null,null,null,null,null,null,null,null,null,null,null,null,"Specialist Altdoc PLUS",null,null,null,null,null,null,null,null,null,null,"Prime PLUS Alt Doc"]
["Company & Trust Loans (>25% Owned): ",null,null,"Non-individual entities: Has the correct information and documentation been collected to verify the customer to ensure we meet our AML obligations including the verification of identity of beneficial owners."]
["Adverse Credit History (incl loan arrears) assessment:",null,null,"Comment on the credit bureau file. Where there is an adverse listing what is the reason and why is it accepted. If there are numerous inquiries and the customer has stated no liabilities - what investigations were done and what was the outcome.  If there are items that don't match the profile of the customer e.g. customer aged 50 and new credit file, document investigations completed.  Is the information on the credit file consistent with the information provided in the customer's application form e.g. in relation to liabilities.",null,null,null,null,null,null,null,null,null,null,null,null,null,null,null,null,null,null,null,null,null,null,null,null,"Near Prime Full Doc"]
["Applicant 1 Income:",null,null,"Summary about the applicant, job, how long employed, income and what documents were used to verify that income and employment.  Is income reasonable for the borrower's employment and age. If self employed what does the applicants business do. ",null,null,null,null,null,null,null,null,null,null,null,null,null,null,null,null,null,null,null,null,null,null,null,null,"Near Prime Alt Doc"]
["Applicant 2 Income:",null,null,"Summary about the applicant, job, how long employed, income and what documents were used to verify that income and employment.  Is income reasonable for the borrower's employment and age. If self employed what does the applicants business do. ",null,null,null,null,null,null,null,null,null,null,null,null,null,null,null,null,null,null,null,null,null,null,null,null,"Specialist Full Doc"]
["COVID Impact (Greater Sydney customers)",null,null,"Has the customer(s) income been affected by COVID lockdowns. If not ascertainable from the application informaton, additional inquiry needs to be made of the customer. If income has been affected, how does the customer intend on navigating that income deterioation until the lockdown is lifted and income recommences."]
["Exit Strategy",null,null,"If the applicants are older than 50 years of age and the loan term exceeds the standard retirement age (67) of the oldest income reliant borrower an exit strategy of how the borower(s) will continue to meet their repayment obligations must be obtained. The borrower(s) exit strategy must be documented and the credit notes included as to why the exit strategy has been deemed reasonable and consistent with Customer's requirements and objectives.",null,null,null,null,null,null,null,null,null,null,null,null,null,null,null,null,null,null,null,null,null,null,null,null,"Specialist Alt Doc"]
["Rental Income:",null,null,"Comment on what rental income is received and used in assessment and how was it verified. ",null,null,null,null,null,null,null,null,null,null,null,null,null,null,null,null,null,null,null,null,null,null,null,null,"Specialist PLUS Full Doc"]
["Conduct assessed (Refinance):",null,null,"Refinance: Comment on conduct of any loans that are being refinanced and where adverse conduct exists why and mitigation. Confirm that 6 months statements held. ",null,null,null,null,null,null,null,null,null,null,null,null,null,null,null,null,null,null,null,null,null,null,null,null,"Specialist PLUS Alt Doc"]
["Funds to complete (Purchase):",null,null,"Purchase: Comment on where the funds to complete are coming from and have been verified. Have 5% genuine savings been verified on Prime > 90%"]
["Declared Living Expense ",{"$f":"Residential!R41","v":0},null,"Comment on whether DLE or benchmark has been relied upon and assessment to be made as to whether or not the declared living expenses are realistic and if so why. Where a declared living expense appears unrealisitc, is zero, or the declared living expense are less than 80% of benchmark, additional inquiry must be made with the broker / borrower and subsequently assessed. If the ratio is substantially over 100%, check if applicant has not doubled up anywhere eg included finance cost on property categories. If bank statements are provided comment on how the transactions on those statement support the DLE."]
["Living Expense Benchmark",{"$f":"SUM(Residential!E40:O40)","v":0}]
["Declared Living Expense % of Benchmark",{"$f":"Residential!R41/SUM(Residential!E40:O40)","v":{"$error":"#DIV/0!"}}]
["Living expense assessment:","Property costs",null,{"$f":"Residential!G50","v":0},{"$f":"[1]Servicing_Calculator!B13","v":"Owner occupied property utilities, rates & costs"},"Include council rates, water, gas & electricity utility bills and body corporate fees where applicable for property owned by the applicant. Assessment should account for these expenses giving account to the type of property (location, house or unit and size). "]
[null,null,null,{"$f":"Residential!G51","v":0},{"$f":"[1]Servicing_Calculator!B14","v":"Investment property utilities, rates & costs"}]
[null,null,null,{"$f":"Residential!G52","v":0},{"$f":"[1]Servicing_Calculator!B15","v":"Rented property costs"},"Include water, gas & electricity bills if the applicant is renting. Assessment should account for these expenses giving account to the type of property (location and size). "]
[null,"Living Expenses",null,{"$f":"Residential!G53","v":0},{"$f":"[1]Servicing_Calculator!B16","v":"Telephone, Internet, pay TV & media streaming"},"Unless an applicant has a mobile phone supplied by their employer, it is expected that each applicant would have a mobile phone expense. If they have a home phone number, they may have a ‘bundle’ with a telco which includes internet."]
[null,null,null,{"$f":"Residential!G54","v":0},{"$f":"[1]Servicing_Calculator!B17","v":"Groceries"},"It is expected that all applicants will have a grocery expense that is reasonable for their family unit size. "]
[null,null,null,{"$f":"Residential!G55","v":0},{"$f":"[1]Servicing_Calculator!B18","v":"Recreation & Entertainment"},"It is expected that all applicants will have some form of recreation & entertainment cost. This includes alcohol, tobacco, gambling, restaurants and membership fees."]
[null,null,null,{"$f":"Residential!G56","v":0},{"$f":"[1]Servicing_Calculator!B19","v":"Clothing & Personal Care"},"It is expected that all applicants will have clothing and personal care expenses that is reasonable for their family unit size. "]
[null,null,null,{"$f":"Residential!G57","v":0},{"$f":"[1]Servicing_Calculator!B20","v":"Medical & Health"},"As an applicant’s age increase it is expected that medical and health costs will increase. In some case this cost may be $0 however given the customers circumstance it should be understood why through additional inquiry."]
[null,null,null,{"$f":"Residential!G58","v":0},{"$f":"[1]Servicing_Calculator!B21","v":"Transport"},"It is expected that all applicants will have a transport cost that is reasonable for their assets and employment position. What are the running costs of each car owned including petrol and servicing or what are the costs of public transport where they commute for work. One exception may be where an applicant has one car only which is provided by their employer or running costs are already include in novated lease payments."]
[null,null,null,{"$f":"Residential!G59","v":0},{"$f":"[1]Servicing_Calculator!B24","v":"Insurance"},"Do the below insurances apply to the applicant(s) and have they been accounted for:\n- House owners with home insurance\n- Car owners (accounted for each car)\n- Private Health - particularly where income is > $90,000 and applicant is single or > $180,000 for families\n- Income and life insurance \n- Pet insurance "]
[null,null,null,{"$f":"Residential!G60","v":0},{"$f":"[1]Servicing_Calculator!B25","v":"Other"},"This is to capture unique items not covered for in the above categories that may be applicable to the applicant(s)."]
[null,"Children",null,{"$f":"Residential!G61","v":0},{"$f":"[1]Servicing_Calculator!B22","v":"Education"},"Where the applicant(s) has school aged children is the declared amount reasonable to cover schools fees, uniform costs and books (if high school). Does the affluency of the applicant indicate that their children may attend a private school, if so, has this been declared by the customer. \n\n"]
[null,null,null,{"$f":"Residential!G62","v":0},{"$f":"[1]Servicing_Calculator!B23","v":"Childcare "},"Where the applicant(s) has pre-school aged children and all applicants work, has a child care cost been included that is reasonable for the location accounting for any rebate that may be due. Where this is applicable and declared expense is $0 additional inquiry needs to be made."]
["Valuation: ",null,null,"COS/Estimate $Amount Date \nVAL $Amount Date \nCAT \nResidential Zoning?\nEssential Repairs? \nRisk ratings XXXX \nComp Sales XXXX \nSelling period within six months? \nAddressed to Pepper in Lender Specific Info? \nComments\n\nAcceptable Security: Yes/No"]
["Other:"]
["Exceptions:",null,null," conclusion and "]
["Recommendation (if assessor is not the DCA approver):",null,null,"If approval recommendation:\nRecommend for Approval. I have made reasonable enquiries to verify that the product will not be unsuitable to the customers’ requirements and objectives and the loan will not cause the customer substantial hardship.  "]
["Approval note:\n",null,null,"If assessor is the approver:\nApproval granted under my DCA. I have made the assessment and confirm that reasonable enquiries to verify that the loan meets the customer's requirements and objectives, is not unsuitable and will not cause the customer substantial hardship. This approval is valid for 90 days. \nIf approver was not the assessor:\nApproval granted under my DCA. I have reviewed the assessment and confirm that reasonable enquiries to verify that the loan meets the customer's requirements and objectives, is not unsuitable and will not cause the customer substantial hardship. This approval is valid for 90 days. \nFinal assessment made at the time of final approval:\nApproval granted under my DCA. I have confirm that reasonable enquiries to verify the customers financial situation and that the loan meets the customer's requirements and objectives, is not unsuitable and will not cause the customer substantial hardship. This approval is valid for 90 days. "]
["ABN search(s)",null,null,"Space for ABN search if not copied directly into NextGen."]
[]
[]
["COMPLIANCE: "]
["Privacy Dec held: "]
["CRO & Features required: "]
["Customer Identification Form: "]
["Is the Borrower a Trust?","Yes",{"$f":"IF(B57=\"Yes\", \"Proceed to Trust Checklist at cell M1 in Workings Tab\", \" \")","v":"Proceed to Trust Checklist at cell M1 in Workings Tab"}]
[]
["SE CHECK COMPLETE:"]
["CUSTOMER ID'D:"]
["Confirm requirements and objectives and benefit:\nIn reviewing the application, your requirements are (a) interest only payments, (b) lowest interest rate and objectives are to purchase the property at ......(address); or (b) refinance the debt with (lender); and/or (c) consolidate debt (i), (ii), (iii) etc . Is this correct? Are there any other requirements and objectives?"]
["Business operated and how long:"]
["Income confirmed:\nDo you expect an increase or decrease in your income over the next 3 years.  If a decrease, describe events that would cause this and your strategy to maintain your repayments / details of your exit strategy."]
["Confirm loan amount, product, interest rate & repayment with the borrower:\nIf there is an indication on the application which suggests financials are avilable for the borrower, we need to question if they are availble, therefore advising they are entitled to a different product (Full Doc)."]
["Any other info:"]
[]
[]
[null,"ACCOUNTANT CHECK COMPLETE:"]
[]
[null,"Called XXXX (verified on TPB - registration number XXXX) on phone number XXXX (internet site)"]
[null,"Confirmed prepared accounts since year XXXX"]
[null,"20XX NPBT $___ Deductions $___"]
[null,"20XX NPBT $___ Deductions $___"]
[null,"Other:"]
[]
[]
[]
[]
[]
[]
[]
[]
[]
[]
[]
[]
[]
[]
[]
[]
[]
[]
[]
[]
[]
[]
[]
[]
[]
[]
[]
[]
[]
[]
[]
[]
[]
[]
[]
[]
[]
[]
[]
[]
[]
[]
[]
[]
[]
[]
[]
[null,"Yes"]
[null,"No"]
[]
[]
[]
[]
[]
[]
[]
[]
[]
[]
[]
[]
[]
[]
[]
[null,"Proceed"]
[null,"Do Not Proceed"]

{"sheet":"Assessment Notes - Commercial","index":18,"n_rows":63,"n_cols":3,"rows_kept":63,"cut":false,"hidden":true,"merged":[[61,1,61,2],[62,1,62,2],[55,1,55,2],[56,1,56,2],[57,1,57,2],[58,1,58,2],[59,1,59,2],[60,1,60,2],[52,0,52,1],[0,2,0,3],[41,0,41,2],[42,0,42,1],[43,0,43,1],[44,0,44,1],[46,0,46,2],[47,0,47,1],[48,0,48,1],[49,0,49,1],[50,0,50,1],[51,0,51,1]]}
["UNDERWRITER NOTES- Commercial",null,"INSTRUCTIONS"]
["Background",null,"Summary of applicants background and business operation.Borrowing History, Lender,Industry Type, Industry Outlook, Management Experience"]
["Purpose",null,"To state whether the asset will be owner occupied or Investment. What is the reason for the money being borrowed. ( ie refinance from XXXBank)"]
["Loan Amount:",null,"Loan amount approved as a result of this assessment"]
["Global Exposure",null,"Total Loan Amount of all Pepper exposure held. If this is the only loan state \"No other exposure held\""]
["Loan term. Interest Only Term",null,"Loan structure . Ie Total loan term and term of interest only"]
["Security Estimate:",null,"Security value amount used for LVR calculation. "]
["NCCP- Yes or No- ",null,"If answered YES use Residential underwriting template"]
["Asset Class",null,"Description of asset class of security. Office, Medical, Retail, Industrial, Industrial Land, Mixed Residential/Commercial, Child Care, Boarding Houses."]
["Address",null,"Address of property being offered as security"]
["Location- Cat 1 or 2",null,"What is the security Property location category?"]
["LVR:",null,"LVR based on loan amount"]
["ICR",null,"Interest cover ratio as per output of Servicing Calculator. Min 1.50 times for Full doc loan and 1.75 times for Alt doc loan"]
["DSCR ",null,"Debt Service ratio as per outcome of Servicing Calculator. **Min 1.25 times for both Full Doc and Alt doc loans."]
["Product:",null,"Product that is recommended for approval. If this is different to what the customer has applied for then comment as to why "]
["Rental Terms: ",null,"Has a tenancy schedule been completed and attached. Does lease term align with expiry of loan if rental forms >50% of total available income to service."]
["Valuation Reviewed. ",null,"Valuation reviewed and acceptable. Refer separate valuation review checklist. Please comment on industry that the tenant is involved in."]
["Fraud Check on Directors",null,"What is the outcome of the Equifax Fraud check in NextGen? If a match, to be referred to Senior Manager to investigate the match"]
["PEP & Sanctions checked:",null,"Is the director/s  confirmed as being on the PEP or Sanctions register (not a potential match). If a match refer to dedicated team member for enhanced search. "]
["ID Document is clear and valid",null,"Have the correct, clear  identification documents and Customer Identification form been completed correctly, signed?"]
["Company & Trust Loans - Beneficial owner with greater than 25% ownership: ",null,"Non-individual entities: Has the correct information and documentation been collected to verify the customer to ensure we meet our AML obligations including the verification of identity of beneficial owners."]
["Directors Guarantee",null,"Is a directors guarantee being taken as part of security?"]
["Guarantors/Sponsors Statement of position",null,"Summary of assets and liabilities of . State main assets (ie home, car, etc) Excess assets over liabilities. State how applicant could meet a call of the guarantee."]
["Supporting Income",null,"What entity and supporting income included in loan assessment"]
["Equifax /commercial search.",null,"Comment on the credit bureau file. Where there is an adverse listing what is the reason and why is it accepted. If there are numerous inquiries and the customer has stated no liabilities - what investigations were done and what was the outcome.  If there are items that don't match the profile of the customer e.g. customer aged 50 and new credit file, document investigations completed.  Is the information on the credit file consistent with the information provided in the customer's application form e.g. in relation to liabilities."]
["Is a PPSR being taken as part of our security.",null,"Does the equifax search reveal a registered interest. State why a party has a secured interest over applicants property and how this could effect our interest."]
["APP 1 Veda",null,"Comment on the credit bureau file. Where there is an adverse listing what is the reason and why is it accepted. If there are numerous inquiries and the customer has stated no liabilities - what investigations were done and what was the outcome.  Is the information on the credit file consistent with the information provided in the customer's application form e.g. in relation to liabilities."]
["Guarantor 1 Income checked:",null,"Summary about the applicant, job, how long employed, income and what documents were used to verify that income and employment.  Is income reasonable for the borrower's employment and age. If self employed what does the applicants industry do."]
["APP 2 Veda",null,"Comment on the credit bureau file. Where there is an adverse listing what is the reason and why is it accepted. If there are numerous inquiries and the customer has stated no liabilities - what investigations were done and what was the outcome.  Is the information on the credit file consistent with the information provided in the customer's application form e.g. in relation to liabilities."]
["Guarantor 2 Income checked:",null,"Summary about the applicant, job, how long employed, income and what documents were used to verify that income and employment.  Is income reasonable for the borrower's employment and age. If self employed what does the applicants industry do."]
["Conduct assessed (Refinance)",null,"Refinance: Comment on conduct of any loans that are being refinanced and where adverse conduct exists why and mitigation. Confirm that 6 months statements held. "]
["Funds to complete ( Purchase):",null,"Purchase: Comment on where the funds to complete are coming from and have been verified. "]
["Other:"]
["Exceptions:",null,"Identify any exceptions and mitigation for the exception approval.  Exceptions required to be approved by Challenger"]
["Exception Register updated",null,"Has the exception to correctly recorded."]
["Conditions Precedent and subsequent",null,"Conditions that are to be included as part of the loan conditions both prior to loan draw down and post loan drawdown."]
["Recommendation:",null,"Recommendation of the deal if not with your DCA \" This file is recommended for approval.\""]
["Joint Approvers Notes",null,"\" This file is jointly approved \" "]
["App1 ABN: "]
["App2 ABN: "]
[]
["COMPLIANCE: "]
["Privacy Dec held: "]
["CRO & Features required: "]
["Customer Identification Form: "]
[]
["SE CHECK COMPLETE:"]
["CUSTOMER ID'D:"]
["Confirm requirements and objectives and benefit:\nIn reviewing the application, your requirements are (a) interest only payments, (b) lowest interest rate and objectives are to purchase the property at ......(address); or (b) refinance the debt with (lender); and/or (c) consolidate debt (i), (ii), (iii) etc . Is this correct? Are there any other requirements and objectives?"]
["Business operated and how long:"]
["Income confirmed:\nDo you expect an increase or decrease in your income over the next 3 years.  If a decrease, describe events that would cause this and your strategy to maintain your repayments / details of your exit strategy."]
["Confirm loan amount, product, interest rate & repayment with the borrower:\nIf there is an indication on the application which suggests financials are available for the borrower, we need to question if they are available, therefore advising they are entitled to a different product (Full Doc)."]
["Any other info:"]
[]
[]
[]
[null,"ACCOUNTANT CHECK COMPLETE:"]
[]
[null,"Called XXXX (verified on TPB - registration number XXXX) on phone number XXXX (internet site)"]
[null,"Confirmed prepared accounts since year XXXX"]
[null,"20XX NPBT $___ Deductions $___"]
[null,"20XX NPBT $___ Deductions $___"]
[null,"Other:"]

{"sheet":"Conditions","index":19,"n_rows":1,"n_cols":4,"rows_kept":1,"cut":false,"hidden":true,"merged":[]}
["Conditions Imposed","How Satisfied","Doc #","Date Satisfied"]

{"sheet":"Cashflow Sensitivity Model","index":20,"n_rows":35,"n_cols":12,"rows_kept":35,"cut":false,"hidden":true,"merged":[[1,3,1,5]]}
["Cashflow Sensitivity Model",null,"Actuals","Best Case","Mid Case","Worst Case"]
[null,null,null,"Reductions in Sales of",null,null,null,null,null,null,null,"Scenarios"]
[null,null,null,0.1,0.25,0.5,"Select",null,null,null,null,"1. reduction in sales volume"]
["Sales",null,500,{"$f":"$C4*(1-D3)","v":450},{"$f":"$C4*(1-$E$3)","v":375},{"$f":"$C4*(1-$F$3)","v":250},"Enter actual sales in highlighted cell",null,null,null,null,"2. reduction in sales prices"]
[null,null,null,null,null,null,null,null,null,null,null,"3. both 1 and 2"]
["COGS",null,{"$f":"C4-C7","v":200},{"$f":"D4-D7","v":202.49999999999997},187.5,137.5]
["Gross Profit $",null,{"$f":"C8*C4","v":300},{"$f":"D8*D4","v":247.50000000000003},187.5,112.5]
["Gross Profit Margin %",null,0.6,0.55000000000000004,0.5,0.45,"Select"]
[]
["Other Variable Expenses"]
["Advertising & Marketing",null,5,{"$f":"$C11*(1-$D$3)","v":4.5},{"$f":"$C11*(1-$E$3)","v":3.75},{"$f":"$C11*(1-$F$3)","v":2.5}]
["Sub-Total",null,{"$f":"SUM(C10:C11)","v":5},{"$f":"SUM(D10:D11)","v":4.5},{"$f":"SUM(E10:E11)","v":3.75},{"$f":"SUM(F10:F11)","v":2.5}]
[]
["Fixed Expenses"]
["Salaries & Wages",null,1,1,1,1]
["Insurances",null,2,2,2,2]
["Superannuation",null,3,3,3,3]
["Property Expenses",null,4,4,4,4]
["Maintenance",null,5,5,5,5]
["Office Supplies",null,6,6,6,6]
["Professional Services",null,7,7,7,7]
["Interest",null,8,8,8,8]
["Leasing",null,9,9,9,9]
["Transport Costs",null,10,10,10,10]
["LHP",null,11,11,11,11]
["Sub-Total",null,{"$f":"SUM(C14:C25)","v":66},{"$f":"SUM(D14:D25)","v":66},66,66]
[]
["NPBT",null,{"$f":"C4-C6-C26-C12","v":229},{"$f":"D4-D6-D26-D12","v":177.00000000000003},117.75,44]
["NPBT %",null,{"$f":"C28/C4","v":0.45800000000000002},{"$f":"D28/D4","v":0.39333333333333342},{"$f":"E28/E4","v":0.314},{"$f":"F28/F4","v":0.17599999999999999}]
["NPAT",null,{"$f":"C28-C29","v":228.542},{"$f":"D28-D29","v":176.60666666666668},117.43600000000001,43.823999999999998]
[]
[]
["% Reduction in Sales",null,null,{"$f":"D3","v":0.1},{"$f":"E3","v":0.25},0.5]
["% Change in GP Ratio",null,null,{"$f":"(D8-C8)/C8","v":-8.3333333333333232E-2},{"$f":"(E8-D8)/D8","v":-9.0909090909090981E-2},-9.9999999999999978E-2]
["% Change in NPBT",null,null,{"$f":"(D28-C28)/C28","v":-0.22707423580786013},{"$f":"(E28-C28)/C28","v":-0.48580786026200873},{"$f":"(F28-C28)/C28","v":-0.80786026200873362}]

{"sheet":"YTD","index":21,"n_rows":17,"n_cols":8,"rows_kept":17,"cut":false,"hidden":true,"merged":[[0,0,0,6],[6,0,6,6],[12,0,12,6]]}
["YEAR-TO-DATE INCOME CALCULATOR"]
["Borrower Name"]
["Loan Id"]
["Start Date","Finish Date","No. of Days","Weeks","YTD Pay","Ave Per Week","Annualised","IF Casual @ 48w"]
["2020-07-01",null,{"$f":"B5-A5","v":-44013},{"$f":"C5/7","v":-6287.5714285714284},null,{"$f":"E5/D5","v":0},{"$f":"F5*52","v":0},{"$f":"G5/52*48","v":0}]
[]
["YEAR-TO-DATE INCOME CALCULATOR"]
["Borrower Name"]
["Loan Id"]
["Start Date","Finish Date","No. of Days","Weeks","YTD Pay","Ave Per Week","Annualised","IF Casual @ 48w"]
[{"$f":"A5","v":"2020-07-01"},null,{"$f":"B11-A11","v":-44013},{"$f":"C11/7","v":-6287.5714285714284},null,{"$f":"E11/D11","v":0},{"$f":"F11*52","v":0},{"$f":"G11/52*48","v":0}]
[]
["YEAR-TO-DATE INCOME CALCULATOR"]
["Borrower Name"]
["Loan Id"]
["Start Date","Finish Date","No. of Days","Weeks","YTD Pay","Ave Per Week","Annualised","IF Casual @ 48w"]
[{"$f":"A5","v":"2020-07-01"},null,{"$f":"B17-A17","v":-44013},{"$f":"C17/7","v":-6287.5714285714284},0,{"$f":"E17/D17","v":0},{"$f":"F17*52","v":0},{"$f":"G17/52*48","v":0}]

{"sheet":"Workings","index":22,"n_rows":42,"n_cols":15,"rows_kept":42,"cut":false,"hidden":true,"merged":[[0,0,0,6]]}
["Loan Affordability Calculator",null,null,null,null,null,null,null,null,null,null,null,"Trust Checklist","Select in white cells","If the responses to all questions below are YES, please proceed with application else resolve the issue first."]
[]
[null,null,null,null,null,null,null,null,null,null,null,null,"Certified copy of trust deed on file?",null,"Certification of the front page of the complete deed, and any amending deed if applicable, is sufficient."]
[null,null,null,null,null,null,null,null,null,null,null,null,{"$f":"IF(N3=\"Yes\", \"PROCEED\", \" RESOLVE\")","v":" RESOLVE"}]
[null,null,null,null,null,null,null,null,null,null,null,null,"Does the trust name on the trust deed match the trust applying for the loan?"]
[null,null,null,null,null,null,null,null,null,null,null,null,{"$f":"IF(N5=\"Yes\", \"PROCEED\", \" RESOLVE\")","v":" RESOLVE"}]
[null,null,null,null,null,null,null,null,null,null,null,null,"Does the trustee of the trust match the applicant entered into NG? ",null,"If individual trustees, all should be listed as borrowers/guarantors on the application. "]
[null,null,null,null,null,null,null,null,null,null,null,null,{"$f":"IF(N7=\"Yes\", \"PROCEED\", \"RESOLVE \")","v":"RESOLVE "}]
[null,null,null,null,null,null,null,null,null,null,null,null,"Is the settled sum of the trust deed less than $10,000?  ",null,"The answer to this is usually YES, however if NO, we will need to verify the identity of the settlor (unless the settlor is deceased in which proof will be required). "]
[null,null,null,null,null,null,null,null,null,null,null,null,{"$f":"IF(N9=\"Yes\", \"PROCEED\", \" RESOLVE\")","v":" RESOLVE"}]
[null,null,null,null,null,null,null,null,null,null,null,null,"Have we identified the beneficial owner(s) of the trust? ",null,"(E.g. appointor, guardian, principal, or unitholder who owns 25% or more of the trust). \n•\tIf beneficial owners match with guarantors listed on the application, no further action is required. \n•\tIf a beneficial owner is not listed as a guarantor on the application, then we will require their identity to be verified (privacy consent + certified copy of ID + World Check screening)"]
[null,null,null,null,null,null,null,null,null,null,null,null,{"$f":"IF(N11=\"Yes\", \"PROCEED\", \"RESOLVE \")","v":"RESOLVE "}]
[null,null,null,null,null,null,null,null,null,null,null,null,"Does the trust deed name the beneficiaries of the trust?        ",null,"NB, unless they are also a trustee or benefiical owner, they do not need to be identified with documents"]
[null,null,null,null,null,null,null,null,null,null,null,null,{"$f":"IF(N13=\"Yes\", \"PROCEED\", \" RESOLVE\")","v":" RESOLVE"}]
[null,null,null,null,null,null,null,null,null,null,null,null,"Is there a corporate trustee for the trust?",null,"If YES, please answer the next question."]
[]
[null,null,null,null,null,null,null,null,null,null,null,null,"If so, do we have a copy of the company search saved on file? "]
[]
[null,null,null,null,null,null,null,null,null,null,null,null,"Have we identified the shareholders who have been issued 25% or more of company shares (e.g. beneficial owner) and are these shares “beneficially held”? ",null,"If beneficial owners match with guarantors listed on the application and shares are “beneficially held”, then no further action is required\nIf a beneficial owner is not listed as a guarantor on the application and shares are “beneficially held”, then we will require their identity to be verified (privacy consent + certified copy of ID + World Check screening). "]
[null,null,null,null,null,null,null,null,null,null,null,null,null,null,"If shares issued are “non-beneficially held” this means that the individual is holding the issued shares on behalf of another person, organisation or trust. Please request for an Accountants Letter or Share Certificate to confirm who owns these shares, in which their identity will need to be verified if not already (privacy consent + certified copy of ID + World Check screening). Further action may be required depending on findings."]
[null,null,null,null,null,null,null,null,null,null,null,null,{"$f":"IF(N19=\"Yes\", \"PROCEED\", \"RESOLVE \")","v":"RESOLVE "}]
[]
[]
[]
[]
[]
[]
[]
[]
[]
[]
[]
[]
[]
[]
[]
[]
[]
[]
[]
[null,null,null,null,null,null,null,null,null,null,null,null,null,"Yes"]
[null,null,null,null,null,null,null,null,null,null,null,null,null,"No"]

{"sheet":"Rental Schedule","index":23,"n_rows":20,"n_cols":30,"rows_kept":20,"cut":false,"hidden":true,"merged":[[26,0,26,3],[1,0,1,1],[2,0,2,1],[22,0,22,3],[23,0,23,3],[25,0,25,3]]}
["Property Schedule"]
["Borrowers' name(s): "]
["Application number(s): "]
["Property Address","Owner(s)","% owned - Borrower 1","% owned - Borrower 2","% owned - Borrower 3","% owned - Borrower 4","Estimated value","Estimated rental","Rent period - select from list","Gross Annual Rent - Note 4.","Investment Loan Balance","Borrower 1 rental share - transfer to DSC","Borrower 2 rental share - transfer to DSC","Borrower 3 rental share - transfer to DSC","Borrower 4 rental share - transfer to DSC","Borrower 1 loan share - transfer to DSC","Borrower 2 loan share - transfer to DSC","Borrower 3 loan share - transfer to DSC","Borrower 4 loan share - transfer to DSC","Actual Interest %","Int deduction $ - Borrower 1","Int deduction $ - Borrower 2","Int deduction $ - Borrower 3","Int deduction $ - Borrower 4"]
[null,null,null,null,null,null,null,null,"Weekly",{"$f":"IF(I5=$AD$5,H5*52, IF(I5=$AD$6,H5*26, IF(I5=$AD$7,H5*12,\" \")))","v":0},null,{"$f":"J5*C5","v":0},{"$f":"J5*D5","v":0},{"$f":"J5*E5","v":0},{"$f":"J5*F5","v":0},{"$f":"K5*C5","v":0},{"$f":"K5*D5","v":0},{"$f":"K5*E5","v":0},{"$f":"K5*F5","v":0},null,{"$f":"T5*P5*C5","v":0},{"$f":"T5*Q5*D5","v":0},{"$f":"T5*R5*E5","v":0},{"$f":"T5*S5*F5","v":0},null,null,null,null,null,"Weekly"]
[null,null,null,null,null,null,null,null,"Weekly",{"$f":"IF(I6=$AD$5,H6*52, IF(I6=$AD$6,H6*26, IF(I6=$AD$7,H6*12,\" \")))","v":0},null,0,0,{"$f":"J6*E6","v":0},{"$f":"J6*F6","v":0},0,0,{"$f":"K6*E6","v":0},{"$f":"K6*F6","v":0},null,{"$f":"T6*Q6*C6","v":0},0,{"$f":"U6*R6*E6","v":0},0,null,null,null,null,null,"Fortnightly"]
[null,null,null,null,null,null,null,null,"Weekly",{"$f":"IF(I7=$AD$5,H7*52, IF(I7=$AD$6,H7*26, IF(I7=$AD$7,H7*12,\" \")))","v":0},null,0,0,0,0,0,0,0,0,null,{"$f":"T7*Q7*C7","v":0},0,0,0,null,null,null,null,null,"Monthly"]
[null,null,null,null,null,null,null,null,"Weekly",0,null,0,0,0,0,0,0,0,0,null,{"$f":"T8*Q8*C8","v":0},0,0,0,null,null,null,null,null,"Annually"]
[null,null,null,null,null,null,null,null,"Weekly",0,null,0,0,0,0,0,0,0,0,null,{"$f":"T9*Q9*C9","v":0},0,0,0]
[null,null,null,null,null,null,null,null,"Weekly",0,null,0,0,0,0,0,0,0,0,null,{"$f":"T10*Q10*C10","v":0},0,0,0]
[null,null,null,null,null,null,null,null,"Weekly",{"$f":"IF(I11=$AD$5,H11*52, IF(I11=$AD$6,H11*26, IF(I11=$AD$7,H11*12,\" \")))","v":0},null,{"$f":"J11*C11","v":0},{"$f":"J11*D11","v":0},{"$f":"J11*E11","v":0},{"$f":"J11*F11","v":0},{"$f":"K11*C11","v":0},{"$f":"K11*D11","v":0},{"$f":"K11*E11","v":0},{"$f":"K11*F11","v":0},null,{"$f":"T11*Q11*C11","v":0},{"$f":"T11*Q11*D11","v":0},{"$f":"U11*R11*E11","v":0},{"$f":"V11*S11*F11","v":0}]
[null,null,null,null,null,null,null,null,"Weekly",0,null,0,0,0,0,0,0,0,0,null,0,0,0,0]
[null,null,null,null,null,null,null,null,"Weekly",0,null,0,0,0,0,0,0,0,0,null,0,0,0,0]
[null,null,null,null,null,null,null,null,"Weekly",0,null,{"$f":"J14*C14","v":0},{"$f":"J14*D14","v":0},0,0,{"$f":"K14*C14","v":0},{"$f":"K14*D14","v":0},0,0,null,{"$f":"T14*Q14*C14","v":0},{"$f":"T14*Q14*D14","v":0},0,0]
[null,null,null,null,null,null,null,null,"Weekly",0,null,{"$f":"J15*C15","v":0},{"$f":"J15*D15","v":0},0,0,{"$f":"K15*C15","v":0},{"$f":"K15*D15","v":0},0,0,null,{"$f":"T15*Q15*C15","v":0},{"$f":"T15*Q15*D15","v":0},0,0]
[null,null,null,null,null,null,null,null,"Weekly",{"$f":"IF(I16=$AD$5,H16*52, IF(I16=$AD$6,H16*26, IF(I16=$AD$7,H16*12,\" \")))","v":0},null,{"$f":"J16*C16","v":0},{"$f":"J16*D16","v":0},0,0,{"$f":"K16*C16","v":0},{"$f":"K16*D16","v":0},0,0,null,{"$f":"T16*Q16*C16","v":0},{"$f":"T16*Q16*D16","v":0},0,0]
[null,null,null,null,null,null,null,null,"Weekly",0,null,0,0,0,0,0,0,0,0,null,0,0,0,0]
[null,null,null,null,null,null,null,null,"Weekly",0,null,0,0,0,0,0,0,0,0,null,0,0,0,0]
[null,null,null,null,null,null,null,null,"Weekly",0,null,0,0,0,0,0,0,{"$f":"K19*E19","v":0},{"$f":"K19*F19","v":0},null,0,0,0,0]
["TOTALS",null,null,null,null,null,{"$f":"SUM(G5:G19)","v":0},{"$f":"SUM(H5:H19)","v":0},null,{"$f":"SUM(J5:J19)","v":0},0,0,0,0,0,null,{"$f":"SUM(Q5:Q19)","v":0},{"$f":"SUM(R5:R19)","v":0},0,null,{"$f":"SUM(U5:U19)","v":0},{"$f":"SUM(V5:V19)","v":0},{"$f":"SUM(W5:W19)","v":0},0]

{"sheet":"BBS & BAS","index":24,"n_rows":94,"n_cols":14,"rows_kept":94,"cut":false,"hidden":true,"merged":[[0,4,0,5],[21,10,21,13],[22,10,22,13],[23,10,23,13],[7,13,9,13],[18,5,18,7],[18,10,18,13],[19,0,19,3],[19,10,19,13],[20,10,20,13],[14,0,14,3],[15,0,15,3],[16,0,16,3],[17,0,17,3],[18,0,18,3]]}
["Step 1","What income is your client declaring?"]
[]
["Step 2","Enter data in the white cells only",null,null,null,null,null,"Number of Quarters used"]
[null,null,null,null,null,null,null,{"$f":"COUNT(B7:B10)","v":0},null,null,"Business Bank Statements Analysis"]
["enter data in white cells only","G1","1A","1B","Net GST","W1","Expenses","Surplus","Expense Ratio",null,null,"Actuals"]
["Must use min of 2 quarters","Sales","Owed to ATO","Owed by ATO",null,"Salaries",null,null,null,null,"Select Period Covered"]
["Quarter 1",null,null,null,{"$f":"C7-D7","v":0},null,{"$f":"D7*11","v":0},{"$f":"B7-E7-F7-G7","v":0}]
["Quarter 2",null,null,null,{"$f":"C8-D8","v":0},null,{"$f":"D8*11","v":0},{"$f":"B8-E8-F8-G8","v":0},null,null,"Enter Sum of Credits",null,null,"Annualised Credits x ATO Average Expense figure"]
["Quarter 3",null,null,null,{"$f":"C9-D9","v":0},null,{"$f":"D9*11","v":0},{"$f":"B9-E9-F9-G9","v":0},null,null,"Annualised",{"$f":"IF(L6=\"Month\",L8*12,IF(L6=\"Quarter\",L8*4,IF(L6=\"6 months\",L8*2,L8)))","v":0}]
["Quarter 4",null,null,null,0,null,0,0]
["TOTAL",{"$f":"SUM(B7:B10)","v":0},{"$f":"SUM(C7:C10)","v":0},0,0,0,0,0,{"$f":"(E11+F11+G11)/B11","v":{"$error":"#DIV/0!"}}]
["Annualised",null,null,null,null,null,null,{"$f":"IF(H4=2,H11*2,IF(H4=3,H11/3*4,H11))","v":0},null,null,"Enter Sum of Business debits from BBS",0,"OR",{"$f":"L9*H18","v":0}]
["Result",null,null,null,null,null,null,{"$f":"IF(E1>H12, \"Refer to Broker\",\"Pass\")","v":"Pass"},null,null,"Annualised",{"$f":"IF(L6=\"Month\",L12*12,IF(L6=\"Quarter\",L12*4,IF(L6=\"6 months\",L12*2,L12)))","v":0}]
[null,null,null,null,null,null,null,null,null,null,"Or Annualised via ATO Average",{"$f":"N12","v":0}]
["BAS Guidelines:",null,null,null,null,"Expense Benchmark",null,"ATO",null,null,"Assessed Surplus",{"$f":"L9-L13-L14","v":0},null,{"$f":"L9-N12","v":0}]
["1. If the annualised surplus exceeds the self employed declared income, proceed with application. Use the declared income in the DSC.",null,null,null,null,"Which Industry?",null,null,null,null,null,{"$f":"IF(E1>L15, \"Refer to Broker\",\"Pass\")","v":"Pass"}]
["2. If the annualised surplus is less than the declared income,  use BBS to verify income. If that is also insufficient, discuss with broker and consider full doc approach.",null,null,null,null,"Total Exp/Turnover % Range",null,null,null,null,"Actual Expense Ratio",{"$f":"L13/L9","v":{"$error":"#DIV/0!"}}]
["3. If you are using the ATO guidance for industry normal surplus, please compare the surplus shown above to the range shown in the ATO table. ",null,null,null,null,"Avge Total Expenses %"]
["4. When Salaries are shown above, check the Self Employed Declaration form to see if applicants' disclose PAYG income. If not, it is to be taken the fuigure shown above is paid to employees, not the applicants. If so, it would be expected to be part or whole of what is declared at W1 on the BAS",null,null,null,null,"http://www.ato.gov.au/Business/Small-business-benchmarks/In-detail/Benchmarks-A-Z/",null,null,null,null,"BBS  Guidelines:"]
["5. If any quarter's 1B - Owed by ATO is significantly larger than other quarters, ask broker to check if any one-off capital purchases were made that quarter as these may inflate the GST owed and therefore the proxy expenses we compute. If that is the case, please ask for documentary support of that purchase to confirm eg invoice, bank statement. ",null,null,null,null,"ATO Small Business Benchmarks",null,null,null,null,"1. Select the period  the bank statements cover"]
[null,null,null,null,null,"Which one do I use?",null,"tax returns",null,null,"2. Identify the business related deposits and expenses, add them up and enter that figure where shown."]
[null,null,null,null,null,null,null,"BAS expense ratio to fit within ATO Range",null,null,"3. If the annualised surplus exceeds the self employed declared income, proceed with application. Use the declared income in the DSC."]
[null,null,null,null,null,null,null,"ATO Average if no BBS expense figure used.",null,null,"4. If the annualised surplus is less than the declared income, you may need to use BAS to verify income. If that is also insufficient, discuss with broker and consider full doc approach."]
[null,null,null,null,null,null,null,null,null,null,"5. If you are using the ATO guidance for industry normal surplus, please use the average shown in the ATO table."]
[]
[]
[]
[]
[]
[]
[]
[]
[]
[]
[]
[]
[]
[]
[]
[]
[]
[]
[]
[]
[]
[]
[]
[]
[]
[]
[]
[]
[]
[]
[]
[]
[]
[]
[]
[]
[]
[]
[]
[]
[]
[]
[]
[]
[]
[]
[]
[]
[]
[]
[]
[]
[]
[]
[]
[]
[]
[]
[]
[]
[]
[]
[]
[]
[]
[]
[null,"Month"]
[null,"Quarter"]
[null,"6 months"]
[null,"12 months"]

{"sheet":"Version Control","index":25,"n_rows":29,"n_cols":6,"rows_kept":29,"cut":false,"hidden":true,"merged":[]}
["Version","Created date","Date Effective","Created By","Approved By","Change"]
[2.5,null,null,null,null,"Assessment rate +1.00%\nCredit Card assess @2.00% of limit\nLiving Expenses:\nSingle - $10,650\nJoint - $15,480\nAdditional Adult - $3,500\nAdditional Children - $3,740\nRental Income – 85% of gross\n"]
[2.6,null,null,null,null,"Assessment rate +1.00%\nCredit Card assess @2.00% of limit\nLiving Expenses:\nSingle - $10,650\nJoint - $15,480\nAdditional Adult - $4,830\nAdditional Children - $3,740\nRental Income – 85% of gross\n"]
[2.7,null,null,null,null,"Assessment rate +1.00%\nCredit Card assess @2.00% of limit\nLiving Expenses:\nSingle - $10,650\nJoint - $15,480\nAdditional Adult - $3,500\nAdditional Children - $3,740\nRental Income – 85% of gross\n"]
[2.8]
[2.9,2008,null,null,null,"Assessment rate +1.50%\nCredit Card assess @2.00% of limit\nLiving Expenses:\nSingle - $11,500\nJoint - $16,500\nAdditional Adult - $5,000\nAdditional Children - $4,200\n"]
[3.2,2008,null,null,null,"Assessment rate +1.50%\nCredit Card assess @2.00% of limit\nLiving Expenses:\nSingle - $12,750\nJoint - $18,250\nAdditional Children - $4,600\n"]
[3.7,"2011-01-28",null,null,null,"Assessment rate +2.00%\nCredit Card assess @2.00% of limit\nLiving Expenses:\nSingle - $14,400\nJoint - $20,400\nAdditional Adult - $14,000\nAdditional Children - $5,240\nRental Income – 85% of gross\nOther Mortgage Payments – Actual Other Liabilities – Actual\n"]
[4.2]
[4.3,null,null,null,null,"Assessment rate +2.00%\nCredit Card assess @2.00% of limit\nLiving Expenses:\nSingle - $15,564\nJoint - $22,620\nEach Dep Child - $5,520\nRental Income – 100% of gross\nOther Mortgage Payments – Actual Other Liabilities – Actual\n"]
[4.5,null,null,null,null,"Assessment rate +2.00%\nCredit Card assess @2.00% of limit\nLiving Expenses:\nSingle - $15,564\nJoint - $22,620\nEach Dep Child - $5,520\nRental Income – 100% of gross\nOther Mortgage Payments – Actual Other Liabilities – Actual\n"]
[4.5999999999999996,null,null,null,null,"Assessment rate +2.00%\nCredit Card assess @2.00% of limit\nLiving Expenses:\nSingle - $15,564\nJoint - $22,620\nEach Dep Child - $5,520\nRental Income – 100% of gross\nOther Mortgage Payments – Actual Other Liabilities – Actual\n"]
[4.92,"2015-09-01",null,null,null,"Assessment rate +2.00% or Floor of 7.20%\nCredit Card assess @3.00% of limit\nLiving Expenses:\nSingle - $15,564\nJoint - $26,724\nAdditional Children - $5,520\nRental Income – 80% of gross\nOther Mortgage Payments - +20%\nOther Liabilities – Actual\n"]
[4.93]
[4.9400000000000004]
[4.96]
[4.97,"2018-03-18","2018-05-28","Neil Culkin","Neil Culkin","Version control added\nAdopted LIXI+ living expense categorisation. \nRemoved mandatory fields for living expenses (broker version only)\nAdded FY2018 tax rates (brackets 3 & 4 income ranges)\nUpdated HPI per latest rates (Q4 2017) from Melbourne Institute \nNegative gearing benefit removed for Untaxed income and Add Backs (F39 & F40)\nP&I repayment now being quoted (E55 & E57)\nRepayment formula’s updated to PMT (I8 & J8)\nMandatory entry of cells for living expenses removed as broker get confused when not applicable. E29 & F29 deleted and B40 changed from 8 to 7 (“rates” sheet)\nAdded comments, extracts from and links to the ATO website in the ‘rates’ tab to explain that there are separate 2 calculations at play, now reflected in the tax calculation (I32:I37) for the broker version:\n Tax Offset for Low income earners\n Medicare levy calculation and Medicare Levy reduction for Low Income earners\n\n"]
[4.97,"2018-05-28","2018-05-28","Neil Culkin","Neil Culkin","Cell D9 amended from \"Loan Term:\" to \"Loan Term (years)\""]
[4.9800000000000004,"2018-07-17","2018-08-13","Neil Culkin","Neil Culkin","Cell B8 now includes commentary that loan amount includes capitalised fee (effective 16/7/2018)\nRequirement for DSR < 50% removed to align with policy\nNSR must be at least 1.35x for LVR > 90%"]
[4.9809999999999999,null,"2018-10-15",null,null,"New internal loan assessment template"]
[5,null,"2019-01-01","Neil Culkin","Credit Committee","Calculator restructured to cater for 2018 Q1 HEM Living Expense\nCRE calculator created\nOther mortgage repayments will be loaded by 25% up from 20%\nIncome for 32.5% tax bracket increase from $87,000 to $90,000\nNegative gearing calculation rate increased to 4.8% to match market offer\n"]
[5.0999999999999996,"2019-04-04","2019-04-17","Devika Dharmapalan ","Neil Culkin","1) A pop up box is to appear on the calculator in the below highlighted area if: The customer declared living expenses (cell R41) is less than 90% of the benchmark (cell R40) AND NSR (cell M75) < 1.5x OR The assessed NSR (cell M75) is ≥1.00 and ≤1.10x AND R40 > R41 The message is to state “To assist Pepper in verifying the customer living expenses, please provide last 3 months transaction bank statements”\n2) Set to True,  \"Is An Applicant\" Cell in both Residential and CRE Tabs, when an applicant exsist but income column is blank or zero\n3) Change Tab Name \"CRE\" to \"Commercial\" and change the heading from \"CRE Serviciability Calculator\" to \"Commercial Servicability Calculator\"\n4) Add new Tab \"Assessment Notes - Commercial\"\n5) Change Tab Name \"Assessment Notes\" to \"Assessment Notes - Residential\"\n6) Change Tab Name \"User Guide - CRE\" to \"User Guide Commercial\"\n7) Change All Macrose to Refer \"Commercial\" tab instead of \"CRE\"\n8) Remove \"Lease Doc\" option from Documnetation Type Field in \"Commercial Tab\"\n9) Devika added the contents provided by Paul Dean to \"Assessment Notes -Commercial\"\n10) Commercial tab - Cell E,G,I,K 52 amended to use income as E,G,I,K 47 less tax instead of E,G,I,K 66. Total taxable Income has to do with the income bracket used to determine the corresponding HEM living expense whereas the total income is what should be used for servicing\n11) Eligible and maximum borrowing amounts (M82 & M83) to note minimum amount of $0"]
[5.2,"2018-06-05",null,"Neil Culkin","Credit Committee","1) BBS & BAS calculator updated\n2) Credit card repayment calculation amended from 3% to 3.82% which as a proxy for assessing a credit card limit being ammortised over 3 years at an interest rate of 22%"]
[5.3,"2019-09-23","2019-10-01","Mick Sedgers","Neil Culkin","1. Reduce Assessment benchmark interest rate to 5.85% (Floor Rate) and Assessment buffer to be increased to 2.50%.\n2. reduce the negative gearing interest rate to 4.06%"]
[5.4,"2020-01-06","2020-03-30","Neil Culkin ","Neil Culkin","1. Living Expense Benchmark updated to HEM Q4 2019\n2. Adjusted Company Tax rate from 30% to 27.5%. This applies to companies with turnovers < $50m which aligns to the Pepper customer profile. \n3. Adjusted CRE ICR & DSCR ratio's changed to 3 decimal places to allow for rounding to the required ICR & DSCR which is on a two declimal point basis. \n4. Fix error: DSR calculation was deducting rental expense (cell M50) from the numerator in the calculation on a monthly basis instead of annual resulting in a over-statement of debt in the calculation. Amended to annual figure.\n5. Reduce the negative gearing interest rate to 3.67%"]
[5.5,"2020-06-22","2020-07-01","Neil Culkin","Neil Culkin","1. Removal of Self employed 1.25 NSR requirement in notes\n2. Adjustment of Company tax from 27.5% to 26% for FY21 tax rates\n3. Addition of Trust question in underwriter templates\n4. Correction in Rental Schedule to calculate share for DSC from 100% column J) and not buffered (column L).\n5. Addition to Rental Schedule to calculate Investment Loan amount for each borrower (columns O & P)\n5. Add 2 additional borrowers in rental Schedule"]
[5.6,"2020-09-10","2020-09-17","Neil Culkin","Neil Culkin","1. Reduce Assessment benchmark interest rate to 5.50% (Floor Rate)\n2. Living Expense Benchmark updated to HEM Q2 2020"]
[5.7,"2020-10-23","2020-11-12","Devika Dharmapalan ","Neil Culkin","1. Updated FY 2021 personal tax rates\n2. Ability to enter to Pepper loan amounts for serviceability (Residential)\n3. Re-introduction of construction loan NSR requirement note\n4. CRE Better Choice calculator with ICR/DSCR \"Refer to BDM\" message\n5. Business name entered to SEIC sheet"]
[5.8,"2021-05-24","2021-08-16","Neil Culkin","Neil Culkin","1. Living Expense Benchmark updated to HEM Q1 2021\n2. Reduce negative gearing interest rate to 3.29%\n3. Correction in Maximum Serviceable Loan Amount formula as the maximum IO term was being conservatively applied to all splits. \n4. Updated Compant Tax rate from 26.00% to 25.00% \n5. Assessment note template changes to include Greater Sydney COVID impact assessment and change Credit File Summary to adverse credit assessment\n6. Updating name to Pepper Money Limited"]