{"text_format":"1","workbook":"xlsx","n_sheets":8,"sheets":["Main Menu","Guide","1_FX_PROOF","2_FX_CALCULATOR","3_SERVICE","HEM Drop In Tables","Calculations ","References"],"not_rendered":{"charts":0,"images":4,"macros":1,"external_links":1,"defined_names":22,"comments":2,"pivot_tables":0},"unopened":[],"bounds":{"document_bytes":16777216,"sheet_cells":100000,"rows_first":2000,"rows_last":500,"rows_between":2000,"halvings":0,"cell_chars":16384,"cell_head_chars":4096},"cells_cut":0,"cells_raw":0,"read":"whole","date_system":"1900"}

{"sheet":"Main Menu","index":0,"n_rows":39,"n_cols":14,"rows_kept":39,"cut":false,"hidden":true,"merged":[]}
[]
[]
[]
[]
[]
[]
[]
[]
[]
[]
[]
[]
[null,null,null,null,null,null,null,null,null,null,null,null,null," "]
[]
[]
[]
[]
[]
[]
[]
{"$rows_left_out":20}
{"sheet":"Guide","index":1,"n_rows":32,"n_cols":11,"rows_kept":32,"cut":false,"hidden":false,"merged":[[0,10,1,16]]}
[null,null,null,null,null,null,null,null,null,null,"How To Guide - 3 Easy Steps"]
[]
[null,null,"STEP 1"]
[]
[null,null,"Obtain 30 day average rate from XE.com - copy and past the  FX Rate proof page  (see how to obtain rate and table to be used below)"]
[null,null,"Foreign Currency Exchange Rate - www.xe.com "]
[]
[]
[]
[]
[]
[]
[]
[]
[null,null,"STEP 2 "]
[null,null,"2) Complete the Rate table. Enter all the currencies and rates you will be using (obtained from XE.com and in proof page). Exchange rates provided in this section will be populated for the rest of the relative currency conversions."]
[null,null,"3) In ALL Cases, complete the  Base FX Income fields"]
[null,null,"4) FX Bonus: use this section if applicant earned bonuses for 2 consecutive years OR if you will be using the bonus and base income to calculate overtime (note - if 2 years overtime is to be calculated and NIL bonuses earnt then place \"0\" in the relative bonus fields)"]
[null,null,"5) Overtime: only use one of the three sections:  regular OT , OT by hour or OT by base and bonus. "]
[null,null,"6) Foreign Rental Income: complete as necessary "]
{"$rows_left_out":13}
{"sheet":"1_FX_PROOF","index":2,"n_rows":28,"n_cols":12,"rows_kept":28,"cut":false,"hidden":false,"merged":[]}
[]
[]
[]
[]
[]
[]
[]
[]
[]
[]
[]
[null,"Foreign Currency Exchange Rate - www.xe.com "]
[]
[]
[]
[]
[]
[]
[]
[]
{"$rows_left_out":9}
{"sheet":"2_FX_CALCULATOR","index":3,"n_rows":97,"n_cols":12,"rows_kept":97,"cut":false,"hidden":false,"merged":[]}
[{"$f":"Guide!Z1","v":0},null,"Version: 26 Oct 2018"]
[]
["Applicant 1"]
["Applicant 2",null,null,"Rate Table"]
["Applicant 3",null,null,"Currency","30-D Avg Rate (Base=AUD)"]
["Applicant 4",null,null,"Select"]
["Select",null,null,"Select"]
["AED",8.3539820174679966E-2,90,"Select"]
["BDT",null,90,"Select"]
["BND","wrong",90,"Select"]
["CAD",6.2756955910968207E-2,90,"Foreign Currency Exchange Rate - www.xe.com "]
["CHF",8.0407995668574622E-2,90]
["CNY",7.9805182345515743E-2,90,null,"Applicant 1","Applicant 2","Applicant 3","Applicant 4"]
["DKK",6.1699999999999998E-2,90,"1. Base FX Income"]
["EUR",6.7376081918175304E-2,90,"Currency","Select","Select","Select","Select"]
["FJD"," ",80,"30-D Avg Rate",{"$f":"IF(E15=\"Select\",\"\",IFERROR(VLOOKUP(E15,$D$6:$E$10,2,FALSE),\"RATE TABLE\"))","v":""},{"$f":"IF(F15=\"Select\",\"\",IFERROR(VLOOKUP(F15,$D$6:$E$10,2,FALSE),\"RATE TABLE\"))","v":""},"",""]
["GBP",8.9953254343893604E-2,90,"Income Cycle","Select","Select","Select","Select"]
["HKD",8.3122723356967396E-2,90,"Pay Per Cycle"]
["IDR",9.5355306729240585E-2,90,"Annualized Income",{"$f":"IFERROR(VLOOKUP(E17,$A$54:$B$58,2,FALSE)*E18,\"\")","v":""},{"$f":"IFERROR(VLOOKUP(F17,$A$54:$B$58,2,FALSE)*F18,\"\")","v":""},{"$f":"IFERROR(VLOOKUP(G17,$A$54:$B$58,2,FALSE)*G18,\"\")","v":""},{"$f":"IFERROR(VLOOKUP(H17,$A$54:$B$58,2,FALSE)*H18,\"\")","v":""}]
["INR",8.4628678109924249E-2,90,"Shading",{"$f":"VLOOKUP(E15,$A$7:$C$45,3,FALSE)","v":0},{"$f":"VLOOKUP(F15,$A$7:$C$45,3,FALSE)","v":0},0,0]
{"$rows_left_out":78}
{"sheet":"3_SERVICE","index":4,"n_rows":88,"n_cols":33,"rows_kept":88,"cut":false,"hidden":false,"merged":[[23,1,24,2],[2,1,3,2],[11,1,11,2],[21,1,21,2],[48,1,48,2],[13,1,14,2],[33,1,33,2],[34,1,34,2],[38,1,38,2],[35,1,35,2],[36,1,36,2],[37,1,37,2],[80,1,81,2],[71,1,72,2],[69,1,69,2],[66,3,66,4],[67,3,67,4],[63,4,63,5],[61,4,61,5],[59,1,59,2],[57,1,58,2],[50,1,51,2],[55,1,55,2]]}
[]
[]
[null,"Proposed Loan",null,null,null,null,null,null,null,null,null,null,null,null,null,null,null,null,"Applicant 1","Applicant 2","Applicant 3","Applicant 4","Low","End","Accu","Rate","Applicant 1","Applicant 2","Applicant 3","Applicant 4","Low","End","Rate"]
[null,null,null,null,null,null,null,null,null,null,null,null,null,null,null,null,null,null,{"$f":"D43","v":0},{"$f":"E43","v":0},{"$f":"F43","v":0},{"$f":"G43","v":0},0,18200,0,0,{"$f":"IF(AND(S4>=$W4,S4<=$X4),1,0)","v":1},{"$f":"IF(AND(T4>=$W4,T4<=$X4),1,0)","v":1},{"$f":"IF(AND(U4>=$W4,U4<=$X4),1,0)","v":1},{"$f":"IF(AND(V4>=$W4,V4<=$X4),1,0)","v":1},{"$f":"W4","v":0},{"$f":"X4","v":18200},0]
[null,"Loan Amount ",null,null,"Rate Type","Select",{"$f":"VLOOKUP(F5,References!AG3:AI30,2,FALSE)/100","v":0},null,null,null,null,null,null,null,null,null,null,null,{"$f":"S4","v":0},{"$f":"T4","v":0},{"$f":"U4","v":0},{"$f":"V4","v":0},18200,37000,0,0.19,{"$f":"IF(AND(S5>$W5,S5<=$X5),1,0)","v":0},0,0,0,{"$f":"W5","v":18200},37000,0.19]
[null,"Loan Term (years)","Select",null,"EXPAT? BOOL",{"$f":"IFERROR(FIND(\"EXPAT\",F5),0)","v":0},null,null,null,null,null,null,null,null,null,null,null,null,{"$f":"S5","v":0},0,0,0,37000,90000,3572,0.32500000000000001,0,0,0,0,37000,90000,0.32500000000000001]
[null,"Margin",null,null,null,null,null,null,null,null,null,null,null,null,null,null,null,null,0,0,0,0,90000,180000,20797,0.37,0,0,0,0,90000,180000,0.37]
[null,"Deal LVR",null,null,null,null,null,null,null,null,null,null,null,null,null,null,null,null,0,0,0,0,180000,999999999,54097,0.45,0,0,0,0,180000,999999999,0.45]
[null,"Actual Interest Rate",{"$f":"G5+C7","v":0},null,null,null,null,null,null,null,null,null,null,null,null,null,null,null,{"$f":"SUMPRODUCT(--(AA4:AA8=1)*Y4:Y8)+VLOOKUP(1,AA4:AH8,7,FALSE)*(S4-VLOOKUP(1,AA4:AH8,5,FALSE))","v":0},{"$f":"SUMPRODUCT(--(AB4:AB8=1)*Y4:Y8)+VLOOKUP(1,AB4:AI8,6,FALSE)*(T4-VLOOKUP(1,AB4:AI8,4,FALSE))","v":0},{"$f":"SUMPRODUCT(--(AC4:AC8=1)*Y4:Y8)+VLOOKUP(1,AC4:AJ8,5,FALSE)*(U4-VLOOKUP(1,AC4:AJ8,3,FALSE))","v":0},{"$f":"SUMPRODUCT(--(AD4:AD8=1)*Y4:Y8)+VLOOKUP(1,AD4:AK8,4,FALSE)*(V4-VLOOKUP(1,AD4:AK8,2,FALSE))","v":0}]
[null,"Actual  Repayment ",{"$f":"IFERROR(PMT(C9/12,C6*12,C5,0),0)","v":0}]
[null,"Assessment Rate ",{"$f":"References!B30","v":5.7500000000000002E-2}]
[null,"Assessed Monthly Repayment ",null,{"$f":"IFERROR('Calculations '!A6,0)","v":0}]
[]
[null,"Living Expenses "]
[]
[null,"Select","Description","Has at least one child <14? (Family allowance)","HEM Monthly Living Expense","Declared Living Expense","Assessed Living Expense"]
[null,"Household 1","Select","Select",{"$f":"IFERROR(HLOOKUP(C17,'HEM Drop In Tables'!$C$1:$J$15,'HEM Drop In Tables'!P16+1,FALSE)*52/12,0)","v":0},null,{"$f":"MAX(E17,F17)","v":0},null,null,{"$f":"SUMIF($D$24:$G$24,B17,$D$48:$G$48)","v":0},{"$f":"IF(AND(F17<>\"\",F17<E17),\"WARNING - The monthly living expenses are below benchmark. Detailed explanation required\",\"\")","v":""}]
[null,"Household 2","Select","Select",{"$f":"IFERROR(HLOOKUP(C18,'HEM Drop In Tables'!$C$1:$J$15,'HEM Drop In Tables'!P17+1,FALSE)*52/12,0)","v":0},null,{"$f":"MAX(E18,F18)","v":0},null,null,{"$f":"SUMIF($D$24:$G$24,B18,$D$48:$G$48)","v":0},{"$f":"IF(AND(F18<>\"\",F18<E18),\"WARNING - The monthly living expenses are below benchmark. Detailed explanation required\",\"\")","v":""}]
[null,"Household 3","Select","Select",{"$f":"IFERROR(HLOOKUP(C19,'HEM Drop In Tables'!$C$1:$J$15,'HEM Drop In Tables'!P18+1,FALSE)*52/12,0)","v":0},null,0,null,null,{"$f":"SUMIF($D$24:$G$24,B19,$D$48:$G$48)","v":0},""]
[null,"Household 4","Select","Select",{"$f":"IFERROR(HLOOKUP(C20,'HEM Drop In Tables'!$C$1:$J$15,'HEM Drop In Tables'!P19+1,FALSE)*52/12,0)","v":0},null,0,null,null,{"$f":"SUMIF($D$24:$G$24,B20,$D$48:$G$48)","v":0},""]
{"$rows_left_out":69}
{"sheet":"HEM Drop In Tables","index":5,"n_rows":19,"n_cols":19,"rows_kept":19,"cut":false,"hidden":true,"merged":[]}
["Low","Select","Couple","Couple with 1 child","Couple with 2 children","Couple with 3 or more children","Single person","Single parent with 1 child","Single parent with 2 children","Single parent with 3 or more children","Household 1","Household 2","Household 3","Household 4","Band","Household 1","Household 2","Household 3","Household 4"]
[0,21000,0,0,0,0,284.40489695056857,0,0,0,{"$f":"'3_SERVICE'!J17","v":0},{"$f":"'3_SERVICE'!J18","v":0},{"$f":"'3_SERVICE'!J19","v":0},{"$f":"'3_SERVICE'!J20","v":0},1,{"$f":"IF(AND(K2>=$A2,K2<$B2),1,0)*$O2","v":1},{"$f":"IF(AND(L2>=$A2,L2<$B2),1,0)*$O2","v":1},{"$f":"IF(AND(M2>=$A2,M2<$B2),1,0)*$O2","v":1},{"$f":"IF(AND(N2>=$A2,N2<$B2),1,0)*$O2","v":1}]
[21000,32000,516.72770580995416,0,0,0,297.54658093159463,391.01898072000557,473.51008260006722,0,{"$f":"K2","v":0},{"$f":"L2","v":0},0,0,{"$f":"O2+1","v":2},0,0,0,0]
[32000,42000,531.04710201716671,608.49470002881503,662.02650654415572,0,311.8604989095362,405.42134921418591,487.8550771638777,482.98785853140629,{"$f":"K3","v":0},{"$f":"L3","v":0},{"$f":"M3","v":0},{"$f":"N3","v":0},{"$f":"O3+1","v":3},0,0,0,0]
[42000,53000,553.4287922192209,630.86294651305184,684.25093529485309,744.19526457743211,334.23365109449674,427.9327821443585,510.27685192221179,505.29930843383022,0,0,0,0,4,0,0,0,0]
[53000,63000,590.16666832927308,667.57875576241668,720.73067845495052,780.98862463818477,370.95752038548034,464.88362901859199,547.0805238434491,541.92182890136496,0,0,0,0,5,0,0,0,0]
[63000,85000,642.45846973608491,719.83914773518075,772.65506900360299,833.35942875200556,423.22940358900576,517.4786056015173,599.46601501910391,594.04943588573383,0,0,0,0,6,0,0,0,0]
[85000,106000,710.3961331511091,787.7360039203719,840.11537903494673,901.39971488199308,491.14117421974515,585.81011548821198,667.5253704033463,661.77378677599836,0,0,0,0,7,0,0,0,0]
[106000,127000,764.41891813526172,841.7263772611193,893.75858135593808,955.50408862020959,545.14336227628587,640.14607246322248,721.64488885503897,715.62693275432514,0,0,0,0,8,0,0,0,0]
[127000,148000,854.81048092525941,932.06357069460057,983.51502194442037,1046.0321666784978,635.50046204339299,731.06160057423085,812.19830108215672,805.73466920736871,0,0,0,0,9,0,0,0,0]
[148000,169000,893.43991076335124,970.66983501507025,1021.8730467640179,1084.7198808200153,674.1151451185184,769.91498545928016,850.8969520230919,844.2428039905775,0,0,0,0,10,0,0,0,0]
[169000,211000,930.439725788945,1007.6474258445461,1058.6128324516603,1121.7755941922483,711.10083469414087,807.12927083912439,887.96299437242544,881.12640347201068,0,0,0,0,11,0,0,0,0]
[211000,264000,1033.4522769872394,1110.5980080429147,1160.9015634057566,1224.9437029049275,814.07409218153816,910.73893279452273,991.15999860549471,983.81548016107376,0,0,0,0,12,0,0,0,0]
[264000,317000,1165.1286225802885,1242.195336359493,1291.6527802709227,1356.8189147537566,945.70032817759318,1043.1787429629162,1123.0722455664811,1115.0784414923742,0,0,0,0,13,0,0,0,0]
[317000,99999999999,1199.3290041596833,1276.3751752419309,1325.6127836559813,1391.0709479931386,979.88757657701126,1077.5772909658203,1157.3338032080089,1149.1713602278126,0,0,0,0,14,0,0,0,0]
[null,null,null,null,null,null,null,null,null,null,null,null,null,null,"Final Band",{"$f":"SUM(P2:P15)","v":1},{"$f":"SUM(Q2:Q15)","v":1},1,1]
[null,null,null,null,null,null,null,null,null,null,null,null,null,null,null,{"$f":"Q16","v":1}]
[null,null,null,null,null,null,null,null,null,null,null,null,null,null,null,{"$f":"R16","v":1}]
[null,null,null,null,null,null,null,null,null,null,null,null,null,null,null,{"$f":"S16","v":1}]

{"sheet":"Calculations ","index":6,"n_rows":350,"n_cols":19,"rows_kept":350,"cut":false,"hidden":true,"merged":[[18,0,19,1]]}
["Assessed Monthly Repayment",null,null,null,null,null,null,null,null,"Actual Repayment"]
["Loan Amount ",{"$f":"'3_SERVICE'!C5","v":0},null,null,null,null,null,null,null,"Loan Amount ",{"$f":"'3_SERVICE'!C5","v":0}]
["Loan Term (years)",{"$f":"'3_SERVICE'!C6","v":"Select"},{"$f":"B3*12","v":{"$error":"#VALUE!"}},null,null,null,null,null,null,"Loan Term (years)",{"$f":"'3_SERVICE'!C6","v":"Select"},{"$f":"K3*12","v":{"$error":"#VALUE!"}}]
["Assessment Rate ",{"$f":"'3_SERVICE'!C11","v":5.7500000000000002E-2},{"$f":"B4/12","v":4.7916666666666672E-3},null,null,null,null,null,null,"Actual Rate",{"$f":"'3_SERVICE'!C9","v":0},{"$f":"K4/12","v":0}]
["Repayment",null,null,null,null,null,null,null,null,"Repayment"]
[{"$f":"-PMT(C4,C3,B2,0)","v":{"$error":"#VALUE!"}},null,null,null,null,null,null,null,null,{"$f":"-PMT(L4,L3,K2)","v":{"$error":"#VALUE!"}}]
[]
["MBC "]
["Loan Term (years)",{"$f":"'3_SERVICE'!C6","v":"Select"},{"$f":"B9*12","v":{"$error":"#VALUE!"}}]
["Assessment Rate ",{"$f":"'3_SERVICE'!C11","v":5.7500000000000002E-2},{"$f":"B10/12","v":4.7916666666666672E-3}]
["Surplus / Deficit",{"$f":"'3_SERVICE'!C78","v":0},{"$f":"'3_SERVICE'!C74-'3_SERVICE'!C75-'3_SERVICE'!C77-1","v":-1}]
["Maximum Borrowing Capacity "]
[{"$f":"-PV(C10,C9,C11)","v":{"$error":"#VALUE!"}}]
[]
[]
["Income "]
[]
[]
["Annual Income"]
[null,null,"Applicant 1","Applicant 2","Applicant 3","Applicant 4","Taxable ",null,null,"Applicant 1 Taxable Income ","Applicant 2 Taxable Income ","Applicant 3 Taxable Income ","Applicant 4 Taxable Income ",null,null,"Applicant 1 Taxable Income ","Applicant 2 Taxable Income ","Applicant 3 Taxable Income ","Applicant 4 Taxable Income "]
{"$rows_left_out":331}
{"sheet":"References","index":7,"n_rows":62,"n_cols":42,"rows_kept":62,"cut":false,"hidden":true,"merged":[[0,4,0,7]]}
["Foreign Exchange Haircut",0.9,null,null,"Dropdowns ",null,null,null,null,"Spouse ",null,null,null,null,null,null,null,null,null,null,null,null,null,null,"Promo Codes"]
["Income",null,null,null,null,"No of Dependants ","TAX Deductible ","Select",null,"Applicant 1","Applicant 2","Applicant 3","Applicant 4",null,"Marital Status ",null,"Loan Purpose",null,null,null,"Employment Type",null,"Assets",null,"None",null,"Income Type",null,"Product Type",null,"Applicant Type",null,"Product Definition","Base Rate","Is PL","Residency Status",null,"Applicant",null,"Repayment Type",null,"Frequency"]
["Type","Percentage Accepted of Gross","Taxed ",null,null,0,"Yes ",30,null,"Applicant 2","Applicant 1","Applicant 1","Applicant 1",null,"NA",null,"Home Extension / Improvement",null,null,null,"Full time PAYG",null,"Owner Occupied Property",null,"Establishment Fee Waiver - Promo til 30-6-17",null,"Gross",null,"Personal Loan Unsecured",null,"Internal Pioneer",null,"Select",0,"N","Aust/NZ citizen",null,"Applicant 1",null,"Interest Only",null,"Weekly"]
[{"$f":"'3_SERVICE'!B26","v":"Gross PAYG (Full time, part time, contract)"},{"$f":"100%","v":1},"Yes",null,null,1,"No",29,null,"Applicant 3","Applicant 3","Applicant 2","Applicant 2",null,"Single",null,"Household Appliances / Furniture",null,null,null,"Part time PAYG",null,"Investment Property",null,"Establishment Fee Waiver- GMY CEO",null,"Net",null,"Personal Loan Mortgage Secured",null,"External Pioneer",null,"CAR.LOAN.3Y",5.99,"Y","Permanent Resident",null,"Applicant 2",null,"Principal and Interest",null,"Fortnightly"]
[{"$f":"'3_SERVICE'!B27","v":"Gross Casual or Temp Income"},{"$f":"100%","v":1},"Yes",null,null,2,null,28,null,"Applicant 4","Applicant 4","Applicant 4","Applicant 3",null,"Married",null,"Debt Consolidation",null,null,null,"Casual",null,"Vehicle",null,null,null,null,null,"Personal Loan Other Secured",null,"Staff Pioneer",null,"CAR.LOAN.3Y.MORE",7.49,"Y","Temporary Resident",null,"Applicant 1 and 2",null,null,null,"Monthly"]
[{"$f":"'3_SERVICE'!B28","v":"Gross Overtime "},0.8,"Yes",null,null,3,null,27,null,"Not in application","Not in application","Not in application","Not in application",null,"De-Facto",null,"Travel",null,null,null,"Contract",null,"Contents",null,null,null,null,null,"Home Loans/Investment Pty Loan",null,"Bare Money",null,"PL.MORTGAGE.SEC",5.5,"Y","Non resident",null,null,null,null,null,"Quarterly"]
[{"$f":"'3_SERVICE'!B29","v":"Gross Bonuses "},0.8,"Yes",null,null,4,null,26,null,null,null,null,null,null,"Divorced",null,"Education",null,null,null,"Temp",null,"Savings",null,null,null,null,null,null,null,null,null,"PL.OTHER.SEC",10.3,"Y",null,null,null,null,null,null,"Annual"]
[{"$f":"'3_SERVICE'!B30","v":"Gross Commissions"},0.8,"Yes",null,null,5,null,25,null,null,null,null,null,null,"Separated",null,"Litigation costs",null,null,null,"Self Employed",null,"Investments",null,null,null,null,null,null,null,null,null,"PL.UNSECURED",12.99,"Y"]
[{"$f":"'3_SERVICE'!B31","v":"Employer allowances"},{"$f":"100%","v":1},"Yes",null,null,6,null,24,null,null,null,null,null,null,"Widowed",null,"Living Expenses",null,null,null,null,null,"Super",null,null,null,null,null,null,null,null,null,"HL.OWNER.OCCUPIER",4.75,"N"]
[{"$f":"'3_SERVICE'!B32","v":"Rental Income"},0.8,"No",null,null,7,null,23,null,null,null,null,null,null,null,null,"Wedding/Honeymoon",null,null,null,null,null,"Other",null,null,null,null,null,null,null,null,null,"HL.INVESTMENT",4.95,"N"]
[{"$f":"'3_SERVICE'!#REF!","v":{"$error":"#REF!"}},0.8,"No",null,null,8,null,22,null,null,"State",null,null,null,null,null,"Deposit for house",null,null,null,null,null,null,null,null,null,null,null,null,null,null,null,"HL.BRIDGING",4.75,"N"]
[{"$f":"'3_SERVICE'!B33","v":"Investment Income "},0.8,"Yes",null,null,9,null,21,null,null,"ACT",null,null,null,null,null,"Owner occupied property purchase",null,null,null,null,null,null,null,null,null,null,null,null,null,null,null,"HL.CONSTRUCTION",4.75,"N"]
[{"$f":"'3_SERVICE'!B34","v":"Government Pension"},1,"No",null,null,10,null,20,null,null,"NSW",null,null,null,null,null,"Property construction",null,null,null,null,null,null,null,null,null,null,null,null,null,null,null,"SMSF.LOAN.RESIDENTIAL",4.75,"N"]
[{"$f":"'3_SERVICE'!B35","v":"Family Allowance/Childcare support/Child maintenance"},1,"No",null,null,11,null,19,null,null,"NT",null,null,null,null,null,"Investment property",null,null,null,null,null,null,null,null,null,null,null,null,null,null,null,"SMSF.LOAN.COMMERCIAL",5.99,"N"]
[{"$f":"'3_SERVICE'!B40","v":0},0,"Yes",null,null,12,null,18,null,null,"QLD",null,null,null,null,null,"Vacant Land",null,null,null,null,null,null,null,null,null,null,null,null,null,null,null,"BUSINESS.LOAN.COMM",5.99,"N"]
[{"$f":"'3_SERVICE'!B41","v":"Other Income "},{"$f":"100%*B1","v":0.9},"Yes",null,null,null,null,17,null,null,"SA",null,null,null,null,null,"Refinance",null,null,null,null,null,null,null,null,null,null,null,null,null,null,null,"BUSINESS.LOAN.RESDENT",4.75,"N"]
["NPBT",1,"Yes",null,null,null,null,16,null,null,"TAS",null,null,null,null,null,"Bridging finance",null,null,null,null,null,null,null,null,null,null,null,null,null,null,null,"Better Choice Owner Occ 90%",3.8,"N"]
["Interest Add Back",1,"No",null,null,null,null,15,null,null,"VIC",null,null,null,null,null,"Other",null,null,null,null,null,null,null,null,null,null,null,null,null,null,null,"<EXPAT>Better Choice Inv P&I 80%",3.79,"N"]
["Depreciation Add Back",0.5,"No",null,null,null,null,14,null,null,"WA",null,null,null,null,null,"Business Purpose",null,null,null,null,null,null,null,null,null,null,null,null,null,null,null,"<EXPAT>Better Choice Inv I/O 80%",3.94,"N"]
["Gross Salary Add Back",1,"Yes",null,null,null,null,13,null,null,null,null,null,null,null,null,"Investment - Non residential property",null,null,null,null,null,null,null,null,null,null,null,null,null,null,null,"<EXPAT>Better Choice Owner Occ 80%",3.64,"N"]
{"$rows_left_out":42}