{"text_format":"1","workbook":"xlsx","n_sheets":18,"sheets":["Introduction","Main Menu","SMSF Introduction","Lease Doc Intro","Non Res Introduction","Serviceability Calculator","NDI DTI Output","SMSF Serviceability Calculator","SMSF DTI Output","Non-Res Serviceability","Non-res DTI Output","Lease Doc Serviceability Calc","Lease Doc DTI Output","Living Allow","Tax Scales","Definitions","Admin","RepayCalculator"],"not_rendered":{"charts":0,"images":1,"macros":1,"external_links":2,"defined_names":18,"comments":0,"pivot_tables":0},"unopened":[],"bounds":{"document_bytes":16777216,"sheet_cells":100000,"rows_first":2000,"rows_last":500,"rows_between":2000,"halvings":0,"cell_chars":16384,"cell_head_chars":4096},"cells_cut":0,"cells_raw":0,"read":"whole","date_system":"1900"}

{"sheet":"Introduction","index":0,"n_rows":39,"n_cols":2,"rows_kept":39,"cut":false,"hidden":true,"merged":[[0,0,0,4],[31,1,33,4],[35,1,37,4],[38,0,39,4],[4,0,6,4],[8,0,11,4],[22,1,22,4],[27,1,28,4],[24,1,26,4],[29,1,30,4]]}
["Serviceability Calculator Instructions"]
[]
["Introduction"]
[]
["Welcome to our Serviceability Calculator.  The Calculator has been developed to provide a balanced assessment of clients borrowing capacity."]
[]
[]
[]
["The Serviceability Calculator incorporates formulas to calculate clients Net Incomes, mortgage repayments and includes built in sensitivity for variance in interest rates to ensure clients can afford repayments when rates change upward by 2.0%.  Should your clients return negative Net Disposal Income (NDI) a figure encapsulated in brackets as the result, the proposal may still be referred to us for separate assessment."]
[]
[]
[]
[]
["Introduction"]
["There are three tabs within this worksheet:"]
{"$rows_left_out":25}
{"sheet":"Main Menu","index":1,"n_rows":0,"n_cols":0,"rows_kept":0,"cut":false,"hidden":false,"merged":[]}

{"sheet":"SMSF Introduction","index":2,"n_rows":49,"n_cols":2,"rows_kept":49,"cut":false,"hidden":true,"merged":[[0,0,0,4],[48,0,49,4],[4,0,6,4],[8,0,11,4],[22,0,22,4],[24,1,24,4],[26,1,27,4],[28,1,31,4],[32,1,34,4],[35,1,38,4],[39,1,40,4],[41,1,43,4],[44,1,47,4]]}
["SMSF Serviceability Calculator\nInstructions"]
[]
["Introduction"]
[]
["Welcome to out Serviceability Calculator.  The Calculator has been developed to provide a balanced assessment of clients borrowing capacity."]
[]
[]
[]
["The Serviceability Calculator incorporates formulas to calculate clients Net Incomes, mortgage repayments and includes built in sensitivity for variance in interest rates to ensure clients can afford repayments when rates change upward by 2.0%.  Should your clients return negative Net Disposal Income (NDI) a figure encapsulated in brackets as the result, the proposal may still be referred to us for separate assessment."]
[]
[]
[]
[]
["Introduction"]
["There are three tabs within this worksheet:"]
{"$rows_left_out":35}
{"sheet":"Lease Doc Intro","index":3,"n_rows":28,"n_cols":2,"rows_kept":28,"cut":false,"hidden":true,"merged":[[0,0,0,4],[27,0,28,4],[1,0,3,4],[5,0,8,4],[19,1,19,4],[21,1,22,4],[24,1,25,4],[26,1,26,4]]}
["Lease Doc Serviceability Calculator Instructions"]
["Welcome to our Lease Doc Calculator.  The Calculator has been developed utilising  current guidelines and attempts to provide a balanced assessment of a Lease Doc clients borrowing capacity."]
[]
[]
[]
["The Lease Doc calculator is available only for Commercial facilites and requires the rental return on an individual Commercial security to return a 120% debt coverage ratio over the particular asset.  Should your clients return a result greater than 1.20%, the proposal may proceed."]
[]
[]
[]
[]
["Introduction"]
["There are three tabs within this worksheet:"]
[]
["Introduction (this sheet)"]
["Serviceability Calculator"]
{"$rows_left_out":14}
{"sheet":"Non Res Introduction","index":4,"n_rows":41,"n_cols":2,"rows_kept":41,"cut":false,"hidden":true,"merged":[[0,0,0,4],[36,1,39,4],[40,0,41,4],[4,0,6,4],[8,0,11,4],[22,1,22,4],[26,1,27,4],[29,1,31,4],[32,1,35,4],[24,1,24,4]]}
["Non-resident Serviceability Calculator Instructions"]
[]
["Introduction"]
[]
["Welcome to our non-resident Serviceability Calculator.  The Calculator has been developed utilising  current guidelines and attempts to provide a balanced assessment of non-resident clients borrowing capacity."]
[]
[]
[]
["The Serviceability Calculator incorporates formulas to calculate clients Net Incomes, mortgage repayments and includes built in sensitivity for variance in interest rates to ensure clients can afford repayments when rates change upward by 2.0% and meets out required Debt Serviceability Ratio requirements."]
[]
[]
[]
[]
["Introduction"]
["There are three tabs within this worksheet:"]
{"$rows_left_out":27}
{"sheet":"Serviceability Calculator","index":5,"n_rows":95,"n_cols":8,"rows_kept":95,"cut":false,"hidden":true,"merged":[[4,1,4,4],[8,7,12,8],[0,0,0,4]]}
["Serviceability Calculator"]
[]
[null,null,"Date:",null,{"$f":"TODAY()","v":"2019-08-01"}]
["Prospector number:"]
["Applicants Name(s):",null,null,null,null,null,null,"Your clients name please"]
[]
[null,"Number"]
["Single Adults",0,{"$f":"B8*'Living Allow'!G6","v":0},null,null,null,null,"Input number of adults and children"]
["Couples",0,{"$f":"B9*'Living Allow'!G7","v":0}]
["Children",0,{"$f":"B10*'Living Allow'!G8","v":0}]
[null,null,{"$f":"SUM(C8:C10)","v":0}]
[]
["Income","Gross Annual Income","Gross Income - Taxable","Gross Income - Non-taxable","Net Monthly Income"]
["Applicant 1 - (Taxable) Income",0,{"$f":"B14+C30-D14","v":0},{"$f":"E30*12","v":0},{"$f":"'Tax Scales'!$J$14+(D14/12)","v":0},null,null,"Input applicants income"]
["Applicant 2 - (Taxable) Income",0,{"$f":"B15+C31-D15","v":0},{"$f":"E31*12","v":0},{"$f":"'Tax Scales'!$J$27+(D15/12)","v":0}]
{"$rows_left_out":81}
{"sheet":"NDI DTI Output","index":6,"n_rows":32,"n_cols":2,"rows_kept":32,"cut":false,"hidden":true,"merged":[]}
["Prospector Number ",{"$f":"'Serviceability Calculator'!B4","v":0}]
["Serviceability calculator type","NDI"]
["Applicant 1 Normal Income",{"$f":"'Serviceability Calculator'!B14+'Serviceability Calculator'!B20","v":0}]
["Applicant 2 Normal Income",{"$f":"'Serviceability Calculator'!B15+'Serviceability Calculator'!B21","v":0}]
["Applicant 3 Normal Income",{"$f":"'Serviceability Calculator'!B16","v":0}]
["Applicant 4 Normal Income",{"$f":"'Serviceability Calculator'!B17","v":0}]
["Applicant 1 Rental Income",{"$f":"'Serviceability Calculator'!B30","v":0}]
["Applicant 2 Rental Income",{"$f":"'Serviceability Calculator'!B31","v":0}]
["Applicant 3 Rental Income",{"$f":"'Serviceability Calculator'!B32","v":0}]
["Applicant 4 Rental Income",{"$f":"'Serviceability Calculator'!B33","v":0}]
["Applicant 1 Company Income",{"$f":"'Serviceability Calculator'!B24","v":0}]
["Applicant 2 Company Income",{"$f":"'Serviceability Calculator'!B25","v":0}]
["Applicant 3 Company Income","N/A"]
["Applicant 4 Company Income","N/A"]
["Total Annual Gross Income",{"$f":"'Serviceability Calculator'!B35","v":0}]
{"$rows_left_out":18}
{"sheet":"SMSF Serviceability Calculator","index":7,"n_rows":93000,"n_cols":8,"rows_kept":93000,"cut":false,"hidden":true,"merged":[[4,1,4,4],[0,0,0,4]]}
["SMSF Serviceability Calculator"]
[]
[null,null,"Date:",null,{"$f":"TODAY()","v":"2019-08-01"}]
["Prospector number:"]
["Applicants Name(s):",null,null,null,null,null,null,"Your clients name please"]
[]
[null,"Number"]
["SMSF income and contributions  "]
["SMSF (Other Assets)",0]
["Income From Other Assets",{"$f":"B9*3.9%","v":0},{"$f":"B10/12","v":0},null,{"$f":"'Tax Scales'!$Y$98","v":0}]
[]
["Superannuation Contributions - Applicant 1",0,{"$f":"B12/12","v":0},null,{"$f":"'Tax Scales'!Y106","v":0}]
["Superannuation Contributions - Applicant 2",0,null,null,{"$f":"'Tax Scales'!Y114","v":0}]
["Superannuation Contributions - Applicant 3",0,null,null,{"$f":"'Tax Scales'!Y122","v":0}]
["Superannuation Contributions - Applicant 4",0,null,null,{"$f":"'Tax Scales'!Y130","v":0}]
{"$rows_left_out":92986}
{"sheet":"SMSF DTI Output","index":8,"n_rows":35,"n_cols":2,"rows_kept":35,"cut":false,"hidden":true,"merged":[]}
["Prospector Number ",{"$f":"'SMSF Serviceability Calculator'!B4","v":0}]
["Serviceability calculator type","SMSF"]
["Applicant 1 Normal Income",{"$f":"'SMSF Serviceability Calculator'!B54+'SMSF Serviceability Calculator'!B60","v":0}]
["Applicant 2 Normal Income",{"$f":"'SMSF Serviceability Calculator'!B55+'SMSF Serviceability Calculator'!B61","v":0}]
["Applicant 3 Normal Income",{"$f":"'SMSF Serviceability Calculator'!B56","v":0}]
["Applicant 4 Normal Income",{"$f":"'SMSF Serviceability Calculator'!B57","v":0}]
["Applicant 1 Rental Income",{"$f":"'SMSF Serviceability Calculator'!B69","v":0}]
["Applicant 2 Rental Income",{"$f":"'SMSF Serviceability Calculator'!B70","v":0}]
["Applicant 3 Rental Income",{"$f":"'SMSF Serviceability Calculator'!B71","v":0}]
["Applicant 4 Rental Income",{"$f":"'SMSF Serviceability Calculator'!B72","v":0}]
["Applicant 1 Company Income",{"$f":"'SMSF Serviceability Calculator'!B64","v":0}]
["Applicant 2 Company Income",{"$f":"'SMSF Serviceability Calculator'!B65","v":0}]
["Applicant 3 Company Income","N/A"]
["Applicant 4 Company Income","N/A"]
["Total Annual Gross Income",{"$f":"'SMSF Serviceability Calculator'!B74","v":0}]
{"$rows_left_out":21}
{"sheet":"Non-Res Serviceability","index":9,"n_rows":99,"n_cols":16,"rows_kept":99,"cut":false,"hidden":true,"merged":[[0,0,0,8],[85,11,87,13],[4,1,4,5],[52,11,58,13],[19,11,39,13],[44,11,47,13]]}
["Non-resident Serviceability Calculator"]
[]
[null,null,null,null,null,null,"Date:",null,{"$f":"TODAY()","v":"2019-08-01"}]
["Prospector number:"]
["Applicants Name(s):",null,null,null,null,null,null,null,null,null,null,"Your clients name please"]
[]
["Country of Residence","China",null,null,null,null,null,null,null,null,null,"Your clients country of residence"]
["Foreign Currency",{"$f":"VLOOKUP(B7,'Living Allow'!$E$20:$G$128,3,FALSE)","v":"CNY - China Yuan Renminbi"}]
["Foreign Currency Exchange Rate - www.xe.com ",0]
[]
[null,"Number"]
["Single Adults",0,{"$f":"B12*'Living Allow'!G6*($G$45/'Living Allow'!$F$17)*1.1","v":0},null,null,null,null,null,null,null,null,"Input number of adults and children"]
["Couples",0,{"$f":"B13*'Living Allow'!G7*($G$45/'Living Allow'!$F$17)*1.1","v":0}]
["Children",0,{"$f":"B14*'Living Allow'!G8*($G$45/'Living Allow'!$F$17)*1.1","v":0}]
["Total Borrowers",{"$f":"B12+(B13*2)","v":0}]
{"$rows_left_out":85}
{"sheet":"Non-res DTI Output","index":10,"n_rows":32,"n_cols":2,"rows_kept":32,"cut":false,"hidden":true,"merged":[]}
["Prospector Number ",{"$f":"'Non-Res Serviceability'!B4","v":0}]
["Serviceability calculator type","NRL"]
["Applicant 1 Normal Income",{"$f":"('Non-Res Serviceability'!B19*'Non-Res Serviceability'!$B$9)+'Non-Res Serviceability'!F19","v":0}]
["Applicant 2 Normal Income",{"$f":"('Non-Res Serviceability'!B20*'Non-Res Serviceability'!$B$9)+'Non-Res Serviceability'!F20","v":0}]
["Applicant 3 Normal Income",{"$f":"('Non-Res Serviceability'!B21*'Non-Res Serviceability'!$B$9)+'Non-Res Serviceability'!F21","v":0}]
["Applicant 4 Normal Income",{"$f":"('Non-Res Serviceability'!B22*'Non-Res Serviceability'!$B$9)+'Non-Res Serviceability'!F22","v":0}]
["Applicant 1 Rental Income",{"$f":"('Non-Res Serviceability'!B34*'Non-Res Serviceability'!$B$9)+'Non-Res Serviceability'!F34","v":0}]
["Applicant 2 Rental Income",{"$f":"('Non-Res Serviceability'!B35*'Non-Res Serviceability'!$B$9)+'Non-Res Serviceability'!F35","v":0}]
["Applicant 3 Rental Income",{"$f":"('Non-Res Serviceability'!B36*'Non-Res Serviceability'!$B$9)+'Non-Res Serviceability'!F36","v":0}]
["Applicant 4 Rental Income",{"$f":"('Non-Res Serviceability'!B37*'Non-Res Serviceability'!$B$9)+'Non-Res Serviceability'!F37","v":0}]
["Applicant 1 Company Income",{"$f":"('Non-Res Serviceability'!B29*'Non-Res Serviceability'!$B$9)+'Non-Res Serviceability'!F29","v":0}]
["Applicant 2 Company Income",{"$f":"('Non-Res Serviceability'!B30*'Non-Res Serviceability'!$B$9)+'Non-Res Serviceability'!F30","v":0}]
["Applicant 3 Company Income","N/A"]
["Applicant 4 Company Income","N/A"]
["Total Annual Gross Income",{"$f":"SUM(B3:B12)","v":0}]
{"$rows_left_out":18}
{"sheet":"Lease Doc Serviceability Calc","index":11,"n_rows":34,"n_cols":7,"rows_kept":34,"cut":false,"hidden":true,"merged":[[4,1,4,3],[0,0,1,3]]}
["Lease Doc Serviceability Calculator"]
[]
[null,null,"Date:",{"$f":"TODAY()","v":"2019-08-01"}]
["Prospector number:"]
["Applicants Name(s):",null,null,null,null,null,"Your clients name please"]
[]
["New Loan Commitment"]
["Repayment Type","Principal & Interest"]
["Loan Term",0]
["Interest Only Term",0]
["New Loan Amount",0,null,null,null,null,"Enter loan amount and interest rate"]
["Interest Rate of New Loan",0]
["Assessment Rate of Loan (minimum 5.50%)",{"$f":"IF(B12+RepayCalculator!B6>RepayCalculator!B8,B12+RepayCalculator!B6,RepayCalculator!B8)","v":5.5E-2}]
["New Monthly Loan Repayment/s",{"$f":"IF(B8=\"Principal & Interest\",-PMT(B12/12,(B9-B10)*12,B11,0,0)+15,(B11*B12)/12+15)","v":{"$error":"#NUM!"}}]
["add Sensitivity adjustment (2% with minimum rate of 5.5%)",{"$f":"IF(B8=\"Principal & Interest\",-PMT(B13/12,(B9-B10)*12,B11,0,0)+15,(B11*B13)/12+15)-B14","v":{"$error":"#NUM!"}}]
{"$rows_left_out":20}
{"sheet":"Lease Doc DTI Output","index":12,"n_rows":32,"n_cols":2,"rows_kept":32,"cut":false,"hidden":true,"merged":[]}
["Prospector Number ",{"$f":"'Lease Doc Serviceability Calc'!B4","v":0}]
["Serviceability calculator type","Lease Doc"]
["Applicant 1 Normal Income",0]
["Applicant 2 Normal Income",0]
["Applicant 3 Normal Income",0]
["Applicant 4 Normal Income",0]
["Applicant 1 Rental Income",{"$f":"'Lease Doc Serviceability Calc'!D20","v":0}]
["Applicant 2 Rental Income",0]
["Applicant 3 Rental Income",0]
["Applicant 4 Rental Income",0]
["Applicant 1 Company Income",0]
["Applicant 2 Company Income",0]
["Applicant 3 Company Income",0]
["Applicant 4 Company Income",0]
["Total Annual Gross Income",{"$f":"B7","v":0}]
{"$rows_left_out":18}
{"sheet":"Living Allow","index":13,"n_rows":128,"n_cols":7,"rows_kept":128,"cut":false,"hidden":true,"merged":[[2,4,2,6]]}
[]
[]
[null,null,"Single","Joint","Living Allowance Calculation"]
[]
[null,0,{"$f":"#REF!","v":{"$error":"#REF!"}},{"$f":"#REF!","v":{"$error":"#REF!"}},null,"$ per Week","$ per Month"]
[null,999,{"$f":"#REF!","v":{"$error":"#REF!"}},{"$f":"#REF!","v":{"$error":"#REF!"}},"Single",356.39,{"$f":"F6*52/12","v":1544.3566666666666}]
[null,1499,{"$f":"#REF!","v":{"$error":"#REF!"}},{"$f":"#REF!","v":{"$error":"#REF!"}},"Couples",518.13,{"$f":"F7*52/12","v":2245.23}]
[null,1999,{"$f":"#REF!","v":{"$error":"#REF!"}},{"$f":"#REF!","v":{"$error":"#REF!"}},"Children",489.48,{"$f":"(F8-F6)*52/12","v":576.72333333333347}]
[null,2499,{"$f":"#REF!","v":{"$error":"#REF!"}},{"$f":"#REF!","v":{"$error":"#REF!"}}]
[null,2999,{"$f":"#REF!","v":{"$error":"#REF!"}},{"$f":"#REF!","v":{"$error":"#REF!"}}]
[null,3499,{"$f":"#REF!","v":{"$error":"#REF!"}},{"$f":"#REF!","v":{"$error":"#REF!"}},"Version Date: 1 August 2019"]
[null,3999,{"$f":"#REF!","v":{"$error":"#REF!"}},{"$f":"#REF!","v":{"$error":"#REF!"}}]
[null,4499,{"$f":"#REF!","v":{"$error":"#REF!"}},{"$f":"#REF!","v":{"$error":"#REF!"}}]
[null,4999,{"$f":"#REF!","v":{"$error":"#REF!"}},{"$f":"#REF!","v":{"$error":"#REF!"}},"HPI Data Date - March 2019"]
[null,5499,{"$f":"#REF!","v":{"$error":"#REF!"}},{"$f":"#REF!","v":{"$error":"#REF!"}},"Cost of Living Data Date - June 2019"]
{"$rows_left_out":114}
{"sheet":"Tax Scales","index":14,"n_rows":130,"n_cols":44,"rows_kept":130,"cut":false,"hidden":true,"merged":[]}
["Annual Salary Guide - Standard",null,null,null,null,null,null,null,null,null,null,null,null,null,null,"Annual Salary Guide - SMSF",null,null,null,null,null,null,null,null,null,null,null,null,null,null,"Annual Salary Guide - Non Resident"]
["Tax Scales ",null,null,null,null,null,null,null,null,null,null,null,null,null,null,"Tax Scales ",null,null,null,null,null,null,null,null,null,null,null,null,null,null,"Tax Scales "]
["Applicant 1",null,null,null,null,null,null,null,null,null,null,null,null,null,null,"Applicant 1",null,null,null,null,null,null,null,null,null,null,null,null,null,null,"Applicant 1"]
["Gross Taxable Income",null,null,"Tax Rate",null,"Gross",null,"Tax",null,"Net",null,"Flood Levy Calculations",null,null,null,"Gross Taxable Income",null,null,"Tax Rate",null,"Gross",null,"Tax",null,"Net",null,"Flood Levy Calculations",null,null,null,"Gross Taxable Income",null,null,"Tax Rate",null,"Gross",null,"Tax",null,"Net",null,"Flood Levy Calculations"]
[1,18200,{"$f":"B5-A5+1","v":18200},0,null,{"$f":"IF('Serviceability Calculator'!C14<B5,'Serviceability Calculator'!C14,C5)","v":0},{"$f":"F5","v":0},{"$f":"F5*D5","v":0},null,{"$f":"F5-H5","v":0},null,null,null,null,null,{"$f":"A5","v":1},18200,{"$f":"C5","v":18200},{"$f":"D5","v":0},null,{"$f":"IF('SMSF Serviceability Calculator'!C54<Q5,'SMSF Serviceability Calculator'!C54,R5)","v":0},{"$f":"U5","v":0},{"$f":"U5*S5","v":0},null,{"$f":"U5-W5","v":0},null,null,null,null,null,-1000000,0,0,0,null,{"$f":"IF('Non-Res Serviceability'!G19<AF5,'Non-Res Serviceability'!G19,AG5)","v":0},{"$f":"AJ5","v":0},{"$f":"AJ5*AH5","v":0},null,{"$f":"AJ5-AL5","v":0}]
[18201,37000,{"$f":"B6-A6+1","v":18800},0.19,null,{"$f":"IF(G5='Serviceability Calculator'!C14,0,IF(('Serviceability Calculator'!C14-G5)>C6,C6,('Serviceability Calculator'!C14-G5)))","v":0},{"$f":"G5+F6","v":0},{"$f":"F6*D6","v":0},null,{"$f":"F6-H6","v":0},null,null,null,null,null,18201,37000,{"$f":"C6","v":18800},0.19,null,{"$f":"IF(V5='SMSF Serviceability Calculator'!$C$54,0,IF(('SMSF Serviceability Calculator'!$C$54-V5)>R6,R6,('SMSF Serviceability Calculator'!$C$54-V5)))","v":0},{"$f":"V5+U6","v":0},{"$f":"U6*S6","v":0},null,{"$f":"U6-W6","v":0},null,null,null,null,null,1,90000,{"$f":"AF6-AE6+1","v":90000},0.32500000000000001,null,{"$f":"IF(AK5='Non-Res Serviceability'!G19,0,IF(('Non-Res Serviceability'!G19-0)>AG6,AG6,('Non-Res Serviceability'!G19-0)))","v":0},{"$f":"AK5+AJ6","v":0},{"$f":"AJ6*AH6","v":0},null,{"$f":"AJ6-AL6","v":0}]
[37001,90000,{"$f":"B7-A7+1","v":53000},0.32500000000000001,null,{"$f":"IF(G6='Serviceability Calculator'!C14,0,IF(('Serviceability Calculator'!C14-G6)>C7,C7,('Serviceability Calculator'!C14-G6)))","v":0},{"$f":"G6+F7","v":0},{"$f":"F7*D7","v":0},null,{"$f":"F7-H7","v":0},null,{"$f":"IF(F7>13000,(F7-13000)*0.5%,0)","v":0},null,null,null,37001,90000,53000,0.32500000000000001,null,{"$f":"IF(V6='SMSF Serviceability Calculator'!$C$54,0,IF(('SMSF Serviceability Calculator'!$C$54-V6)>R7,R7,('SMSF Serviceability Calculator'!$C$54-V6)))","v":0},{"$f":"V6+U7","v":0},{"$f":"U7*S7","v":0},null,{"$f":"U7-W7","v":0},null,{"$f":"IF(U7>13000,(U7-13000)*0.5%,0)","v":0},null,null,null,90001,180000,{"$f":"AF7-AE7+1","v":90000},0.37,null,{"$f":"IF(AK6='Non-Res Serviceability'!G19,0,IF(('Non-Res Serviceability'!G19-AK6)>AG7,AG7,('Non-Res Serviceability'!G19-AK6)))","v":0},{"$f":"AK6+AJ7","v":0},{"$f":"AJ7*AH7","v":0},null,{"$f":"AJ7-AL7","v":0},null,{"$f":"IF(AJ7>13000,(AJ7-13000)*0.5%,0)","v":0}]
[90001,180000,{"$f":"B8-A8+1","v":90000},0.37,null,{"$f":"IF(G7='Serviceability Calculator'!C14,0,IF(('Serviceability Calculator'!C14-G7)>C8,C8,('Serviceability Calculator'!C14-G7)))","v":0},{"$f":"G7+F8","v":0},{"$f":"F8*D8","v":0},null,{"$f":"F8-H8","v":0},null,{"$f":"SUM(M8:N8)","v":0},{"$f":"IF(F8<=20000,F8*0.5%,0)","v":0},{"$f":"IF(F8>20000,((F8-20000)*1%)+100,0)","v":0},null,90001,180000,90000,0.37,null,{"$f":"IF(V7='SMSF Serviceability Calculator'!$C$54,0,IF(('SMSF Serviceability Calculator'!$C$54-V7)>R8,R8,('SMSF Serviceability Calculator'!$C$54-V7)))","v":0},{"$f":"V7+U8","v":0},{"$f":"U8*S8","v":0},null,{"$f":"U8-W8","v":0},null,{"$f":"SUM(AB8:AC8)","v":0},{"$f":"IF(U8<=20000,U8*0.5%,0)","v":0},{"$f":"IF(U8>20000,((U8-20000)*1%)+100,0)","v":0},null,180000,10000000,{"$f":"AF8-AE8+1","v":9820001},0.45,null,{"$f":"IF(AK7='Non-Res Serviceability'!G19,0,IF(('Non-Res Serviceability'!G19-AK7)>AG8,AG8,('Non-Res Serviceability'!G19-AK7)))","v":0},{"$f":"AK7+AJ8","v":0},{"$f":"AJ8*AH8","v":0},null,{"$f":"AJ8-AL8","v":0},null,{"$f":"SUM(AQ8:AR8)","v":0},{"$f":"IF(AJ8<=20000,AJ8*0.5%,0)","v":0},{"$f":"IF(AJ8>20000,((AJ8-20000)*1%)+100,0)","v":0}]
[180001,10000000,{"$f":"B9-A9+1","v":9820000},0.45,null,{"$f":"IF('Serviceability Calculator'!C14-G8<=0,0,('Serviceability Calculator'!C14-G8))","v":0},{"$f":"G8+F9","v":0},{"$f":"F9*D9","v":0},null,{"$f":"F9-H9","v":0},null,{"$f":"F9*1%","v":0},null,null,null,180001,10000000,9820000,0.45,null,{"$f":"IF(V8='SMSF Serviceability Calculator'!$C$54,0,IF(('SMSF Serviceability Calculator'!$C$54-V8)>R9,R9,('SMSF Serviceability Calculator'!$C$54-V8)))","v":0},{"$f":"V8+U9","v":0},{"$f":"U9*S9","v":0},null,{"$f":"U9-W9","v":0},null,{"$f":"U9*1%","v":0},null,null,null,10000001,20000000,{"$f":"AF9-AE9+1","v":10000000},0.45,null,{"$f":"IF('Non-Res Serviceability'!G19-AK8<=0,0,('Non-Res Serviceability'!G19-AK8))","v":0},{"$f":"AK8+AJ9","v":0},{"$f":"AJ9*AH9","v":0},null,{"$f":"AJ9-AL9","v":0},null,{"$f":"AJ9*1%","v":0}]
[null,null,null,"Totals:",null,{"$f":"SUM(F5:F9)","v":0},null,{"$f":"SUM(H5:H9)","v":0},null,{"$f":"SUM(J5:J9)","v":0},null,{"$f":"SUM(L7:L9)","v":0},null,null,null,null,null,null,"Totals:",null,{"$f":"SUM(U5:U9)","v":0},null,{"$f":"SUM(W5:W9)","v":0},null,{"$f":"SUM(Y5:Y9)","v":0},null,{"$f":"SUM(AA7:AA9)","v":0},null,null,null,null,null,null,"Totals:",null,{"$f":"IF('Non-Res Serviceability'!$G$19<0,SUM(AJ5:AJ9),SUM(AJ6:AJ9))","v":0},null,{"$f":"SUM(AL5:AL9)","v":0},null,{"$f":"SUM(AN5:AN9)","v":0},null,{"$f":"SUM(AP7:AP9)","v":0}]
["Low & middle income tax offset (monthly)",null,{"$f":"IF($F$10<=$B$97,$D$97,(IF($F$10<=$B$98,$D$98,IF($F$10<=$B$99,(($F$10-$B$98)*$C$99)+$D$99,IF($F$10<=$B$100,$D$100,IF($F$10<=$B$101,(($F$10-$B$100)*$C$101)+$D$101,IF($F$10<=$B$102,$D$102,0)))))))/12","v":0},"Refer table",null,null,null,null,null,null,null,null,null,null,null,"Low & middle income tax offset (monthly)",null,{"$f":"IF($U$10<=$B$97,$D$97,(IF($U$10<=$B$98,$D$98,IF($U$10<=$B$99,(($U$10-$B$98)*$C$99)+$D$99,IF($U$10<=$B$100,$D$100,IF($U$10<=$B$101,(($U$10-$B$100)*$C$101)+$D$101,IF($U$10<=$B$102,$D$102,0)))))))/12","v":0},"Refer table",null,null,null,null,null,null,null,null,null,null,null,"Budget Repair Levy (monthly)",null,0,"N/A"]
["Low income tax offset (monthly)",null,{"$f":"IF($F$10<=$B$109,$D$109,IF($F$10<=$B$110,$D$110,IF($F$10<=$B$111,(($F$10-$B$110)*$C$111)+$D$111,IF($F$10<=$B$112,$D$112,0))))/12","v":0},"Refer table",null,null,null,null,null,null,null,null,null,null,null,"Low income tax offset (monthly)",null,{"$f":"IF($U$10<=$B$109,$D$109,IF($U$10<=$B$110,$D$110,IF($U$10<=$B$111,(($U$10-$B$110)*$C$111)+$D$111,IF($U$10<=$B$112,$D$112,0))))/12","v":0},"Refer table"]
["Medicare Levy (monthly)",null,{"$f":"F10*(2/100)/12","v":0},0.02,null,null,null,null,null,null,null,null,null,null,null,"Medicare Levy (monthly)",null,{"$f":"U10*(2/100)/12","v":0},0.02,null,null,null,null,null,null,null,null,null,null,null,"Medicare Levy (monthly)",null,0,"N/A"]
[null,null,{"$f":"SUM(C11:C13)","v":0},null,null,null,null,"Monthly",null,{"$f":"(J10/12)-C14","v":0},null,null,null,null,null,null,null,{"$f":"SUM(R11:R13)","v":0},null,null,null,null,"Monthly",null,{"$f":"(Y10/12)-R14","v":0},null,null,null,null,null,null,null,{"$f":"SUM(AG11:AG13)","v":0},null,null,null,null,"Monthly",null,{"$f":"(AN10/12)-AG14","v":0}]
[]
{"$rows_left_out":116}
{"sheet":"Definitions","index":15,"n_rows":41,"n_cols":2,"rows_kept":41,"cut":false,"hidden":true,"merged":[[0,0,0,1]]}
["Definitions"]
[]
[]
["Definitions"]
[]
["Gross Annual Income","Yearly cash component of salary before tax. (Taxable income).  To be entered by you."]
[]
["Gross Monthly Income","Yearly cash component of salary, before tax, divided by twelve.  Automatically calculated."]
[]
["Net Monthly Income","Monthly cash component of salary after tax.  Automatically calculated."]
[]
["Taxable Income","Taxable income of the applicant.  Enter the gross annual income and the calculator will calculate the net monthly figure using the current Marginal Tax Rates automatically."]
[]
["Non-Taxable Income","Non taxable income of the applicant.  This is generally pension or governement benefit income that is not taxable."]
[]
{"$rows_left_out":27}
{"sheet":"Admin","index":16,"n_rows":20,"n_cols":13,"rows_kept":20,"cut":false,"hidden":true,"merged":[[18,12,18,25],[19,12,19,25]]}
[]
[]
[]
[]
[]
[]
[]
[]
[]
[]
[]
[]
[]
[]
[]
{"$rows_left_out":6}
{"sheet":"RepayCalculator","index":17,"n_rows":50,"n_cols":4,"rows_kept":50,"cut":false,"hidden":true,"merged":[]}
["Dropdown box data"]
["Principal & Interest"]
["Interest Only"]
[]
[]
["Serviceability Sensitivity",0.02]
[]
["Interest Rate Floor",5.5E-2]
[]
["Interest Only Period","Loan Term"]
[0,30]
[1,29]
[2,28]
[3,27]
[4,26]
{"$rows_left_out":35}